{"text_format":"1","workbook":"xlsx","n_sheets":12,"sheets":["GebStandard","EingabeMaske","Berechnung und Ergebnis","RND","Updates","Vergleichsdaten LGMB 2025","Formel","UK","Vergleichsfaktoren 2025 (2)","Indizes 2024 Schätzung 2025","Indizes 2025 Schätzung 2026","RND ImmoWertV"],"not_rendered":{"charts":0,"images":5,"macros":1,"external_links":3,"defined_names":549,"comments":2,"pivot_tables":0},"unopened":[],"bounds":{"document_bytes":16777216,"sheet_cells":100000,"rows_first":2000,"rows_last":500,"rows_between":2000,"halvings":0,"cell_chars":16384,"cell_head_chars":4096},"cells_cut":0,"cells_raw":0,"read":"whole","date_system":"1900"}

{"sheet":"GebStandard","index":0,"n_rows":29,"n_cols":19,"rows_kept":29,"cut":false,"hidden":false,"merged":[[0,1,0,11],[1,6,1,10],[28,2,28,11]]}
[null,"Gebäudestandards und Wägungsanteile für Mehrfamilienhäuser und Wohnhäuser mit Mischnutzung;\n\nStufen 3 - 5 gemäß Anlage 4 der ImmoWertV,\n\nStufen 1 + 2 Ergänzungen durch Sprengnetter"]
[]
[null,null,null,null,null,null,null,null,null,null,{"$f":"EingabeMaske!E1","v":"WE-Rechner, Version 2 - LGMB 2025, Stand 11.2025"}]
[null,"Wägungsan- teile (∑100 %)","Stufe 1",null,"Stufe 2",null,"Stufe 3",null,"Stufe 4",null,"Stufe 5"]
[null,"Außenwände","Holzfachwerk, Ziegelmauerwerk; Fugenglattstrich, Putz, Verkleidung mit Faserzementplatten, Bitumenschindeln oder einfachen Kunststoffplatten; kein oder deutlich nicht zeitgemäßer Wärmeschutz (vor ca. 1980)",null,"ein-/zweischaliges Mauerwerk, z. B. Gitterziegel oder Hohlblocksteine; verputzt und gestrichen oder Holzverkleidung; nicht zeitgemäßer Wärmeschutz (vor ca. 1995)",null,"ein-/zweischaliges Mauerwerk, z. B. aus Leichtziegeln, Kalksandsteinen, Gasbetonsteinen; Edelputz; Wärmedämmverbundsystem oder Wärmedämmputz (nach ca. 1995)",null,"Verblendmauerwerk, zweischalig, hinterlüftet, Vorhangfassade (z. B. Naturschiefer); Wärmedämmung (nach ca. 2005)",null,"aufwendig gestaltete Fassaden mit konstruktiver Gliederung (Säulenstell-ungen, Erker etc.), Sichtbeton-Fertig-teile, Natursteinfassade, Elemente aus Kupfer-/Eloxalblech, mehrgeschoss. Glasfassaden; hochwertigste Dämmung",null,null,{"$f":"IF(N6=TRUE,1,0)","v":0},{"$f":"IF(O6=TRUE,1,0)","v":0},1,0,0]
[null,"23%",{"$f":"ROUND($B6/$S6*N5,4)","v":0},null,{"$f":"ROUND($B6/$S6*O5,4)","v":0},null,{"$f":"ROUND($B6/$S6*P5,4)","v":0.23},null,{"$f":"ROUND($B6/$S6*Q5,4)","v":0},null,{"$f":"ROUND($B6/$S6*R5,4)","v":0},null,null,false,false,true,false,false,{"$f":"COUNTIF(N6:R6,TRUE)","v":1}]
[null,"Dach","Dachpappe, Faserzementplatten/ Wellplatten; keine bis geringe Dachdämmung",null,"einfache Betondachsteine oder Tondachziegel,  Bitumenschindeln; nicht zeitgemäße Dachdämmung (vor ca. 1995)",null,"Faserzement-Schindeln, beschichtete Betondachsteine und Tondachziegel, Folienabdichtung; Dachdämmung (nach ca. 1995)",null,"glasierte Tondachziegel, Flachdach- ausbildung tlw. als Dachterrassen; Konstruktion in Brettschichtholz, schweres Massivflachdach; besondere Dachformen, z. B. Mansarden-, Walmdach; Aufsparrendämmung, überdurchschn. Dämmung (nach ca. 2005)",null,"hochwertige Eindeckung z. B. aus Schiefer oder Kupfer, Dachbegrünung, befahrbares Flachdach; stark überdurchschnittliche Dämmung",null,null,{"$f":"IF(N8=TRUE,1,0)","v":0},{"$f":"IF(O8=TRUE,1,0)","v":0},{"$f":"IF(P8=TRUE,1,0)","v":1},{"$f":"IF(Q8=TRUE,1,0)","v":0},{"$f":"IF(R8=TRUE,1,0)","v":0}]
[null,"15%",{"$f":"ROUND($B8/$S8*N7,4)","v":0},null,{"$f":"ROUND($B8/$S8*O7,4)","v":0},null,{"$f":"ROUND($B8/$S8*P7,4)","v":0.15},null,{"$f":"ROUND($B8/$S8*Q7,4)","v":0},null,{"$f":"ROUND($B8/$S8*R7,4)","v":0},null,null,false,false,true,false,false,{"$f":"COUNTIF(N8:R8,TRUE)","v":1}]
[null,"Fenster und Außentüren","Einfachverglasung; einfache Holztüren",null,"Zweifachverglasung (vor ca. 1995); Haustür mit nicht zeitgemäßem Wärmeschutz (vor ca. 1995)",null,"Zweifachverglasung (nach ca. 1995), Rollläden (manuell); Haustür mit zeitgemäßem Wärmeschutz (nach ca. 1995)",null,"Dreifachverglasung, Sonnenschutz- glas, aufwendigere Rahmen, Rollläden (elektr.); höherwertige Türanlagen z. B. mit Seitenteil, besonderer Einbruchschutz",null,"große feststehende Fensterflächen, Spezialverglasung (Schall- und Sonnenschutz); Außentüren in hochwertigen Materialien",null,null,{"$f":"IF(N10=TRUE,1,0)","v":0},{"$f":"IF(O10=TRUE,1,0)","v":0},{"$f":"IF(P10=TRUE,1,0)","v":1},{"$f":"IF(Q10=TRUE,1,0)","v":0},{"$f":"IF(R10=TRUE,1,0)","v":0}]
[null,"11%",{"$f":"ROUND($B10/$S10*N9,4)","v":0},null,{"$f":"ROUND($B10/$S10*O9,4)","v":0},null,{"$f":"ROUND($B10/$S10*P9,4)","v":0.11},null,{"$f":"ROUND($B10/$S10*Q9,4)","v":0},null,{"$f":"ROUND($B10/$S10*R9,4)","v":0},null,null,false,false,true,false,false,{"$f":"COUNTIF(N10:R10,TRUE)","v":1}]
[null,"Innenwände und -türen","Fachwerkwände, einfache Putze/Lehmputze, einfache Kalkanstriche; Füllungstüren, gestrichen, mit einfachen Beschlägen ohne Dichtungen",null,"massive tragende Innenwände, nicht tragende Wände in Leichtbauweise   (z. B. Holzständerwände mit Gipskarton), Gipsdielen; leichte Türen, Stahlzargen",null,"nicht tragende Innenwände in massiver Ausführung bzw. mit Dämmmaterial gefüllte Ständerkonstruktionen; schwere Türen",null,"Sichtmauerwerk; Massivholztüren, Schiebetürelemente, Glastüren, strukturierte Türblätter",null,"gestaltete Wandabläufe (z. B. Pfeilervorlagen, abgesetzte oder geschwungene Wandpartien);  Brandschutzverkleidung; raumhohe aufwendige Türelemente",null,null,{"$f":"IF(N12=TRUE,1,0)","v":0},{"$f":"IF(O12=TRUE,1,0)","v":0},{"$f":"IF(P12=TRUE,1,0)","v":1},{"$f":"IF(Q12=TRUE,1,0)","v":0},{"$f":"IF(R12=TRUE,1,0)","v":0}]
[null,"11%",{"$f":"ROUND($B12/$S12*N11,4)","v":0},null,{"$f":"ROUND($B12/$S12*O11,4)","v":0},null,{"$f":"ROUND($B12/$S12*P11,4)","v":0.11},null,{"$f":"ROUND($B12/$S12*Q11,4)","v":0},null,{"$f":"ROUND($B12/$S12*R11,4)","v":0},null,null,false,false,true,false,false,{"$f":"COUNTIF(N12:R12,TRUE)","v":1}]
[null,"Deckenkon- struktion","Holzbalkendecken ohne Füllung, Spalierputz",null,"Holzbalkendecken mit Füllung, Kappendecken",null,"Betondecken mit Tritt- und Luftschallschutz (z. B. schwimmender Estrich); einfacher Putz",null,"zusätzlich Deckenverkleidung",null,"Deckenvertäfelungen (Edelholz, Metall)",null,null,{"$f":"IF(N14=TRUE,1,0)","v":0},{"$f":"IF(O14=TRUE,1,0)","v":0},{"$f":"IF(P14=TRUE,1,0)","v":1},{"$f":"IF(Q14=TRUE,1,0)","v":0},{"$f":"IF(R14=TRUE,1,0)","v":0}]
[null,"11%",{"$f":"ROUND($B14/$S14*N13,4)","v":0},null,{"$f":"ROUND($B14/$S14*O13,4)","v":0},null,{"$f":"ROUND($B14/$S14*P13,4)","v":0.11},null,{"$f":"ROUND($B14/$S14*Q13,4)","v":0},null,{"$f":"ROUND($B14/$S14*R13,4)","v":0},null,null,false,false,true,false,false,{"$f":"COUNTIF(N14:R14,TRUE)","v":1}]
[null,"Fußböden ","ohne Belag",null,"Linoleum-, Teppich-, Laminat- und PVC-Böden einfacher Art und Ausführung",null,"Linoleum-, Teppich-, Laminat- und PVC-Böden besserer Art und Ausführung, Fliesen, Kunststeinplatten",null,"Natursteinplatten, Fertigparkett, hochwertige Fliesen, Terrazzobelag, hochwertige Massivholzböden auf aufgedämmter Unterkonstruktion",null,"hochwertiges Parkett, hochwertige Natursteinplatten, hochwertige Edelholzböden auf gedämmter Unterkonstruktion",null,null,{"$f":"IF(N16=TRUE,1,0)","v":0},{"$f":"IF(O16=TRUE,1,0)","v":0},{"$f":"IF(P16=TRUE,1,0)","v":1},{"$f":"IF(Q16=TRUE,1,0)","v":0},{"$f":"IF(R16=TRUE,1,0)","v":0}]
[null,"5%",{"$f":"ROUND($B16/$S16*N15,4)","v":0},null,{"$f":"ROUND($B16/$S16*O15,4)","v":0},null,{"$f":"ROUND($B16/$S16*P15,4)","v":0.05},null,{"$f":"ROUND($B16/$S16*Q15,4)","v":0},null,{"$f":"ROUND($B16/$S16*R15,4)","v":0},null,null,false,false,true,false,false,{"$f":"COUNTIF(N16:R16,TRUE)","v":1}]
[null,"Sanitärein- richtungen","einfaches Bad mit Stand-WC; Installation auf Putz, Ölfarbenanstrich, einfache PVC-Bodenbeläge",null,"1 Bad mit WC, Dusche oder Badewanne; einfache Wand- und Bodenfliesen, teilweise gefliest",null,"1 Bad mit WC je Wohneinheit; Dusche und  Badewanne;  Wand- und Bodenfliesen, raumhoch gefliest",null,"1 – 2 Bäder je Wohneinheit mit tlw. zwei Waschbecken, tlw. Bidet/ Urinal, Gäste-WC, bodengleiche Dusche; Wand- und Bodenfliesen jeweils in gehobener Qualität",null,"2 und mehr Bäder je Wohneinheit; hochwertige Wand- und Bodenplatten (oberflächenstrukturiert, Einzel- und Flächendekors)",null,null,{"$f":"IF(N18=TRUE,1,0)","v":0},{"$f":"IF(O18=TRUE,1,0)","v":0},{"$f":"IF(P18=TRUE,1,0)","v":1},{"$f":"IF(Q18=TRUE,1,0)","v":0},{"$f":"IF(R18=TRUE,1,0)","v":0}]
[null,"9%",{"$f":"ROUND($B18/$S18*N17,4)","v":0},null,{"$f":"ROUND($B18/$S18*O17,4)","v":0},null,{"$f":"ROUND($B18/$S18*P17,4)","v":0.09},null,{"$f":"ROUND($B18/$S18*Q17,4)","v":0},null,{"$f":"ROUND($B18/$S18*R17,4)","v":0},null,null,false,false,true,false,false,{"$f":"COUNTIF(N18:R18,TRUE)","v":1}]
[null,"Heizung","Einzelöfen, Schwerkraftheizung",null,"Fern- oder Zentralheizung, einfache Warmluftheizung, einzelne Gasaußen-wandthermen, Nachtstromspeicher-, Fußbodenheizung (vor ca. 1995)",null,"elektronisch gesteuerte Fern- oder Zentralheizung, Niedertemperatur- oder Brennwertkessel",null,"Fußbodenheizung, Solarkollektoren für Warmwassererzeugung",null,"Solarkollektoren für Warmwassererzeugung und Heizung, Blockheizkraftwerk, Wärmepumpe, Hybrid-Systeme",null,null,{"$f":"IF(N20=TRUE,1,0)","v":0},{"$f":"IF(O20=TRUE,1,0)","v":0},{"$f":"IF(P20=TRUE,1,0)","v":1},{"$f":"IF(Q20=TRUE,1,0)","v":0},{"$f":"IF(R20=TRUE,1,0)","v":0}]
[null,"9%",{"$f":"ROUND($B20/$S20*N19,4)","v":0},null,{"$f":"ROUND($B20/$S20*O19,4)","v":0},null,{"$f":"ROUND($B20/$S20*P19,4)","v":0.09},null,{"$f":"ROUND($B20/$S20*Q19,4)","v":0},null,{"$f":"ROUND($B20/$S20*R19,4)","v":0},null,null,false,false,true,false,false,{"$f":"COUNTIF(N20:R20,TRUE)","v":1}]
[null,"Sonstige technische Ausstattung","sehr wenige Steckdosen, Schalter und Sicherungen, kein Fehlerstromschutzschalter (FI-Schalter), Leitungen teilweise auf Putz",null,"wenige Steckdosen, Schalter und Sicherungen",null,"zeitgemäße Anzahl an Steckdosen und Lichtauslässen; Zählerschrank (ab ca. 1985) mit Unterverteilung und Kippsicherungen",null,"zahlreiche Steckdosen und Lichtaus- lässe, hochwertige Abdeckungen, de-zentrale Lüftung mit Wärme- tauscher, mehrere LAN- und Fernseh-anschlüsse, Personenaufzugsanlagen",null,"Video- und zentrale Alarmanlage, zentrale Lüftung mit Wärmetauscher, Klimaanlage, Bussystem; aufwendige Personenaufzugsanlagen",null,null,{"$f":"IF(N22=TRUE,1,0)","v":0},{"$f":"IF(O22=TRUE,1,0)","v":0},{"$f":"IF(P22=TRUE,1,0)","v":1},{"$f":"IF(Q22=TRUE,1,0)","v":0},{"$f":"IF(R22=TRUE,1,0)","v":0}]
[null,"6%",{"$f":"ROUND($B22/$S22*N21,4)","v":0},null,{"$f":"ROUND($B22/$S22*O21,4)","v":0},null,{"$f":"ROUND($B22/$S22*P21,4)","v":0.06},null,{"$f":"ROUND($B22/$S22*Q21,4)","v":0},null,{"$f":"ROUND($B22/$S22*R21,4)","v":0},null,null,false,false,true,false,false,{"$f":"COUNTIF(N22:R22,TRUE)","v":1}]
[null,"Summe",{"$f":"SUM(C6:C22)","v":0},null,{"$f":"SUM(E6:E22)","v":0},null,{"$f":"SUM(G6:G22)","v":1},null,{"$f":"SUM(I6:I22)","v":0},null,{"$f":"SUM(K6:K22)","v":0}]
[null,"Standardstufe (gewogen):",null,null,{"$f":"(1*C23+2*E23+3*G23+4*I23+5*K23)","v":3},null," 2 bis 5",null,{"$f":"IF(E24<2,\"Grenzwert wird unterschritten\",\"\")","v":""}]
[]
[null,"Die Ermittlung des Gebäudestandards über die Gebäudestandardtabelle wurde durchgeführt",null,null,null,null,null,null,null,null,"nein"]
[]
[null,"Hinweis:",{"$f":"\"Das tatsächliche Baujahr nach Eintragung in der EingabeMaske beträgt \"&EingabeMaske!D16&\".\"","v":"Das tatsächliche Baujahr nach Eintragung in der EingabeMaske beträgt 1995."}]
[null,null,{"$f":"IF(OR((E24>2)*(E24<=2.5)*(EingabeMaske!D16>=2000),(E24<=3)*(EingabeMaske!D16>=2015)),\"Die Standardstufe in Höhe von \"&E24&\" ist - bezogen auf das Baujahr - außergewöhnlich niedrig. \nBitte überprüfen Sie Ihre Eingaben!\",\"\")","v":""}]

{"sheet":"EingabeMaske","index":1,"n_rows":41,"n_cols":7,"rows_kept":41,"cut":false,"hidden":false,"merged":[[2,0,2,4],[4,0,4,4],[3,0,3,3],[6,1,6,2],[17,0,18,0],[10,1,10,3],[12,1,12,3],[11,1,11,3],[11,0,12,0],[15,0,15,1],[38,6,38,11],[28,1,28,2],[21,0,21,1],[35,0,35,1],[34,0,34,1],[30,6,30,11],[27,6,27,11],[29,6,29,11]]}
[null,null,null,null,"WE-Rechner, Version 2 - LGMB 2025, Stand 11.2025"]
[]
["Vergleichswertberechnung für Wohnungseigentum mittels Anwendungsfunktion aus dem Landesgrundstücksmarktberichtes 2025"]
["gem. § 182 Abs.2 BewG i. V. m. § 183 BewG. "]
[]
[]
["Eingabefelder blau","Berechnungsfelder rot"]
[]
["Angaben zum Wertermittlungsobjekt"]
[]
["Adresse und Ort","Musterstraße 13, 00000 Musterstadt"]
["Gemeinde / Gemarkung / Landkreis bzw. Stadt:",null,null,"Bobenheim-Roxheim - Roxheim"]
[null," /  / "]
[]
["Wertermittlungsstichtag (WST):",null,null,"2024-01-02"]
["tatsächliches Baujahr",null,null,1995]
["Anzahl der Sondereigentume im Gebäude (ASE)",null,null,10]
["Miteigentumsanteil (MEA)",null,"Zähler",1]
[null,null,"Nenner",10]
["Grundstücksfläche (Gf):",null,null,1000]
["Gesamtflächenanteil (GF-Anteil)",{"$f":"IF(D21>260,\"Flächenanteil überschreitet Grenzwert\",\"\")","v":""},null,{"$f":"IF(ROUND(D20*D18/D19,1)<=300,ROUND(D20*D18/D19,1),\"Grenzwert übeschritten\")","v":100}]
["Bodenrichtwert (BRW) 01.01.2024\n(Auf ältere Stichtage erfolgt eine Umrechnung mittels eines Indexes)",null,null,300]
["Wohnfläche (WF)",null,null,82]
["Vermietungssituation (VS)",null,"(vermietet =1, unvermietet = 0)",0]
["Sondereigentume, Sondernutzungsrechte"]
["Anzahl Garagen",0,"Anzahl Stellplätze der Garage/n",0,null,null,{"$f":"IF((B26>0)*(D26=0),\"Eingabe Anzahl der Stellplätze erforderlich!\",\"\")","v":""}]
["Anzahl Carports",0,"Anzahl Stellplätze der/des Carports",0,null,null,{"$f":"IF((B27>0)*(D27=0),\"Eingabe Anzahl der Stellplätze erforderlich!\",\"\")","v":""}]
["Außenstellplätze",null,"Anzahl",0]
["Sonstiges",null,null,0]
[]
["Gebäudestandardstufe (GST): siehe Blatt \"GebStandard\"",null,{"$f":"IF(GebStandard!K26=\"nein\",\"Ermittlung des Gebäudestandards wurde nicht bestätigt!\",\"\")","v":"Ermittlung des Gebäudestandards wurde nicht bestätigt!"},{"$f":"IF(GebStandard!K26=\"nein\",\"Standardtabelle auf Blatt GebStandard ausfüllen\",IF(GebStandard!E24>=2,GebStandard!E24,\"Grenzwert von 2,0 unterschritten\"))","v":"Standardtabelle auf Blatt GebStandard ausfüllen"},null,null,{"$f":"IF(GebStandard!E24<2,\"Der Gebäudestandard liegt unter der Standardstufe 2. Somit ist der Grenzwert unterschritten und die Bewertung hat im Sachwertverfahren zu erfolgen!\",\"\")","v":""}]
["Marktsegment",null,null,{"$f":"VLOOKUP(EingabeMaske!B$13,'Vergleichsfaktoren 2025 (2)'!A8:H3022,6)","v":0},null,null,{"$f":"IF(D22>1500,\"Plausibel? Wurde nicht irrtümlich ein Geschäftslagenwert statt des Wohnlagewertes eingegeben?\",\"\")","v":""}]
["Index nach Marktsegment zum Wertermittlungsstichtag (2010 =100):",null,null,{"$f":"IF(D15<DATE(2025,1,2),'Indizes 2024 Schätzung 2025'!Y18,'Indizes 2025 Schätzung 2026'!Y18)","v":{"$error":"#N/A"}}]
["Miteigentumsanteil (MEA)",null,"in Prozent",{"$f":"IF(D18>=D19,\"Fehler\",ROUND(D18/D19,4))","v":0.1}]
["Vergleichswert ggf. vorhandener Garage/n, Carport/s und Außenstellplätzen",null,"rd.",{"$f":"'Berechnung und Ergebnis'!E44+'Berechnung und Ergebnis'!E45+'Berechnung und Ergebnis'!E46","v":{"$error":"#N/A"}}]
["Vergleichswert inkl. ggf. vorhandener Garage/n, Carport/s und Außenstellplätzen",null,"rd.",{"$f":"'Berechnung und Ergebnis'!K51","v":{"$error":"#N/A"}}]
[]
[null,null,null," pauschale Schäzung"]
["fiktives Baujahr: siehe Blatt \"RND\"",{"$f":"IF(RND!G34=\"ja\",RND!G33,\"liegt nicht vor\")","v":"liegt nicht vor"},"Gebäudestandard nach fiktivem Baujahr nicht übernehmen",{"$f":"'Vergleichsdaten LGMB 2025'!B33","v":"-"},null,null,{"$f":"IF(C39='Vergleichsdaten LGMB 2025'!A23,\"Die pauschale Schätzung des Gebäudestandards auf Grundlage des fiktiven Baujahres ist zur Berechnung des Bedarfswerts nur im Ausnahmefall zu übernehmen.\",\"\")","v":""}]
[]
["Quelle: Oberer Gutachterausschuss für Grundstückswerte Rheinland-Pfalz gem. Landesgrundstückmarktbericht 2025"]

{"sheet":"Berechnung und Ergebnis","index":2,"n_rows":54,"n_cols":11,"rows_kept":54,"cut":false,"hidden":false,"merged":[[1,1,1,10],[18,1,18,10],[53,1,53,10],[22,1,22,10],[35,1,35,10],[41,1,41,10],[49,1,49,4],[40,2,40,4],[43,6,43,7],[44,6,44,7],[45,6,45,7]]}
[null,{"$f":"EingabeMaske!E1","v":"WE-Rechner, Version 2 - LGMB 2025, Stand 11.2025"}]
[null,"Vergleichswertberechnung für Wohnungseigentum mittels Anwendungsfunktion aus dem Landesgrundstücksmarktberichtes 2025 gem. § 182 Abs.2 BewG i. V. m. § 183 BewG"]
[]
[null,"Bezeichnung des Wertermittlungsobjekts der \nBewertung nach § 183 BewG:"]
[null,{"$f":"EingabeMaske!B11","v":"Musterstraße 13, 00000 Musterstadt"}]
[null,"Angaben zum Wertermittlungsobjekt (WO)"]
[null,"Wertermittlungsstichtag (WST):",null,null,null,null,null,null,null,null,{"$f":"EingabeMaske!D15","v":"2024-01-02"}]
[null,"Anzahl der Wohneinheiten in der Wohnanlage:",null,null,null,null,null,null,null,null,{"$f":"EingabeMaske!D17","v":10}]
[null,{"$f":"EingabeMaske!A20","v":"Grundstücksfläche (Gf):"},null,null,null,null,null,null,null,null,{"$f":"ROUND(EingabeMaske!D20,0)","v":1000}]
[null,"Miteigentumsanteil:",null,null,null,null,null,null,null,null,{"$f":"ROUND(EingabeMaske!D34,4)","v":0.1}]
[null,"Bodenrichtwert (BRW) 01.01.2024:",null,null,null,null,null,null,null,null,{"$f":"ROUND(EingabeMaske!D22,0)","v":300}]
[null,{"$f":"EingabeMaske!A31","v":"Gebäudestandardstufe (GST): siehe Blatt \"GebStandard\""},null,null,null,null,null,null,null,null,{"$f":"ROUND(EingabeMaske!D31,2)","v":{"$error":"#VALUE!"}}]
[null,"Wohnfläche (WF):",null,null,null,null,null,null,null,null,{"$f":"ROUND(EingabeMaske!D23,2)","v":82}]
[null,"Vermietungssituation:",null,null,null,null,null,null,null,null,{"$f":"IF(EingabeMaske!D24=0,\"unvermietet\",\"vermietet\")","v":"unvermietet"}]
[null,"Sondereigentume, Sondernutzungsrechte:",null,{"$f":"EingabeMaske!B26","v":0},"Garage/n","mit",{"$f":"EingabeMaske!D26","v":0},"Stellplätzen",null,null,{"$f":"'Vergleichsdaten LGMB 2025'!L18","v":{"$error":"#N/A"}}]
[null,null,null,{"$f":"EingabeMaske!B27","v":0},"Carport/s","mit",{"$f":"EingabeMaske!D27","v":0},"Stellplätzen",null,null,{"$f":"'Vergleichsdaten LGMB 2025'!L19","v":{"$error":"#N/A"}}]
[null,null,null,{"$f":"EingabeMaske!D28","v":0},"Außenstellplätze",null,null,null,null,null,{"$f":"'Vergleichsdaten LGMB 2025'!L20","v":{"$error":"#N/A"}}]
[null,null,null,null,{"$f":"IF(EingabeMaske!B29=0,\"\",EingabeMaske!B29)","v":""},null,null,null,null,null,{"$f":"EingabeMaske!D29","v":0}]
[null,"Der objektspezifisch angepasste Vergleichsfaktor im Sinne von § 26 ImmoWertV wird durch Einsetzen der Einflussgrößen in die Anwendungsfunktion sowie anschließender Anpassung mit Hilfe der Indexreihe EFH an den Wertermittlungsstichtag ermittelt. Danach erfolgt die Multiplikation dieses objektspezifisch angepassten Vergleichsfaktors mit der Bezugsgröße (Wohnfläche), um den Vergleichswert zu erhalten. \nWeitere Besonderheiten, insbesondere die den Wert beeinflussenden Belastungen privatrechtlicher und öffentlich-rechtlicher Art, werden im Vergleichswertverfahren gemäß § 183 BewG nicht berücksichtigt."]
[null,"Berechnung des Vergleichswertes"]
[null,"Ermittlung des Vergleichsfaktors (VF) aus der Anwendungsfunktion:"]
[null,"VF (01.01.2024) = a + b x ASE + c x Gf + d x BWN(01.01.2024) + e x St + f x WF + g x WF² + h x Vs"]
[null,{"$f":"\"VF (01.01.2024) = \"&K25&\"  + (\"&H26&\" x \"&E26&\") + \"&H27&\" x \"&E27&\" m² + \"&H28&\" x \"&E28&\" €/m² + \"&H29&\" x \"&E29&\" + \"&H30&\" x \"&E30&\" m² + (\"&H31&\" x (\"&E30&\" m²)²) + (\"&H32&\" x \"&E32&\")\"","v":{"$error":"#N/A"}}]
[]
[null,"Marktsegment","MS","=",{"$f":"EingabeMaske!D32","v":0},null,"a",{"$f":"ROUND('Vergleichsdaten LGMB 2025'!I5,6)","v":{"$error":"#N/A"}},null,null,{"$f":"ROUND(H25,6)","v":{"$error":"#N/A"}}]
[null,"Anzahl Sondereigentume im Gebäude","ASE","=",{"$f":"EingabeMaske!D17","v":10},"x","b",{"$f":"ROUND('Vergleichsdaten LGMB 2025'!I6,6)","v":0},null,"+",{"$f":"ROUND(H26*E26,6)","v":0}]
[null,"Gesamtflächenanteil in m²  \n(Grundstücksfläche x Miteigentumsanteil)","GF","=",{"$f":"EingabeMaske!D21","v":100},"x","c",{"$f":"ROUND('Vergleichsdaten LGMB 2025'!I7,6)","v":0},null,"+",{"$f":"ROUND(H27*E27,6)","v":0}]
[null,"Bodenwertniveau zum 01.01.2024 in €/m²","BWN","=",{"$f":"EingabeMaske!D22","v":300},"x","d",{"$f":"ROUND('Vergleichsdaten LGMB 2025'!I8,6)","v":0},null,"+",0]
[null,"Gebäudestandard nach NHK 2010","St","=",{"$f":"IF(EingabeMaske!C39='Vergleichsdaten LGMB 2025'!A23,EingabeMaske!D39,EingabeMaske!D31)","v":"Standardtabelle auf Blatt GebStandard ausfüllen"},"x","e",{"$f":"ROUND('Vergleichsdaten LGMB 2025'!I9,6)","v":0},null,"+",{"$error":"#VALUE!"}]
[null,"Wohnfläche","WF","=",{"$f":"EingabeMaske!D23","v":82},"x","f",{"$f":"ROUND('Vergleichsdaten LGMB 2025'!I10,6)","v":0},null,"+",0]
[null,null,"WF²","=",{"$f":"E30^2","v":6724},"x","g",{"$f":"ROUND('Vergleichsdaten LGMB 2025'!I11,6)","v":0},null,"+",0]
[null,"Vermietungssituation","VS","=",{"$f":"EingabeMaske!D24","v":0},"x","h",{"$f":"ROUND('Vergleichsdaten LGMB 2025'!I12,6)","v":0},null,"+",0]
[null,null,null,null,null,null,null,null,null,"=",{"$f":"SUM(K25:K32)","v":{"$error":"#N/A"}}]
[null,"vorl. Vergleichsfaktor (01.01.2024) aus der Anwendungsfunktion:",null,null,null,null,null,null,null,"rd.",{"$f":"ROUND(K33,2)","v":{"$error":"#N/A"}}]
[]
[null,"Berücksichtigung der veränderten Wertverhältnisse zwischen dem Richtwertstichtag und dem Wertermittlungsstichtag"]
[null,"Zwischenergebnis: ",null,null,null,null,null,null,null,null,{"$f":"K34","v":{"$error":"#N/A"}}]
[null,"UK Wertermittlungsstichtag (Index):",null,null,null,null,null,null,null,"x",{"$f":"EingabeMaske!D33","v":{"$error":"#N/A"}}]
[null,"UK Richtwertstichtag (Index):",null,null,null,null,null,null,null," /",{"$f":"IF(K7<DATE(2025,1,2),'Indizes 2024 Schätzung 2025'!AA18,'Indizes 2025 Schätzung 2026'!AA18)","v":{"$error":"#N/A"}}]
[null,"Zwischenergebnis: ",null,null,null,null,null,null,null,null,{"$f":"ROUND(K37*K38/K39,2)","v":{"$error":"#N/A"}}]
[]
[null,"Zuschläge für Sondereigentume / Sondernutzungsrechte"]
[null,"Zwischenergebnis: ",null,null,null,null,null,null,null,null,{"$f":"K40","v":{"$error":"#N/A"}}]
[null,"Garage/n:",null,null,{"$f":"K15","v":{"$error":"#N/A"}}," /",{"$f":"K13&\" m² x \"&K38&\" / \"&K39","v":{"$error":"#N/A"}},null,null,"+",{"$f":"ROUND(E44/K$13*K$38/K$39,2)","v":{"$error":"#N/A"}}]
[null,"Carport/s:",null,null,{"$f":"K16","v":{"$error":"#N/A"}}," /",{"$f":"G44","v":{"$error":"#N/A"}},{"$f":"K13","v":82},null,"+",{"$f":"ROUND(E45/K$13*K$38/K$39,2)","v":{"$error":"#N/A"}}]
[null,"Außenstellplätze:",null,null,{"$f":"K17","v":{"$error":"#N/A"}}," /",{"$f":"G44","v":{"$error":"#N/A"}},{"$f":"K13","v":82},null,"+",{"$error":"#N/A"}]
[null,{"$f":"E18","v":""},null,null,{"$f":"K18","v":0}," /",null,{"$f":"K13","v":82},null,"+",{"$f":"E47/H47","v":0}]
[null,"Zwischenergebnis:",null,null,null,null,null,null,null,"=",{"$f":"SUM(K43:K47)","v":{"$error":"#N/A"}}]
[null,"Wohnfläche:",null,null,null,null,null,null,null,"x",{"$f":"K13","v":82}]
[null,"Vergleichswert (VW):",null,null,null,null,null,null,null,"=",{"$f":"ROUND(K48*K49,2)","v":{"$error":"#N/A"}}]
[null,"Vergleichswert (gerundet):",null,null,null,null,null,null,null,null,{"$f":"ROUND(K50,-2)","v":{"$error":"#N/A"}}]
[]
[]
[null,{"$f":"EingabeMaske!A41","v":"Quelle: Oberer Gutachterausschuss für Grundstückswerte Rheinland-Pfalz gem. Landesgrundstückmarktbericht 2025"}]

{"sheet":"RND","index":3,"n_rows":34,"n_cols":12,"rows_kept":34,"cut":false,"hidden":true,"merged":[[4,0,4,4],[4,6,4,9],[0,0,0,9],[2,6,2,9],[3,0,3,4],[3,6,3,9],[5,0,5,4],[5,6,5,9],[6,0,6,4],[6,6,6,9],[7,0,7,4],[7,6,7,9],[15,0,15,4],[16,0,16,4],[17,0,17,4],[18,0,18,4],[19,0,19,4],[11,0,11,4],[11,6,11,9],[8,0,8,4],[8,6,8,9],[9,0,9,4],[9,6,9,9],[10,0,10,4],[10,6,10,9],[33,1,33,4],[33,6,33,9],[25,0,30,0],[25,6,25,9],[26,1,26,4],[26,6,26,9],[27,1,27,4],[27,6,27,8],[28,1,28,9],[29,1,29,4],[29,6,29,8],[30,6,30,8],[31,1,31,3],[32,1,32,4],[13,6,13,9],[21,6,21,9],[31,12,31,16],[32,12,32,20],[26,12,26,16],[26,18,26,20],[27,12,27,16],[28,12,28,16],[29,12,29,16],[30,12,30,16],[31,6,31,8],[32,6,32,9],[23,0,23,9],[24,0,24,9],[14,0,14,4],[14,6,14,8]]}
["Modell zur Ermittlung der Restnutzungsdauer für Wohngebäude bei Modernisierungen (Anlage 2 ImmoWertV) "]
[]
["Modernisierungen, die in den letzten 10 Jahren durchgeführt wurden",null,null,null,null,null,"Punkte",null,null,null,null,"max. Punkte"]
["Dacherneuerung inklusive Verbesserung der Wärmedämmung",null,null,null,null,"nein",{"$f":"IF(F4=\"ja\",L4,0)","v":0},null,null,null,null,4]
["Modernisierung der Fenster und Außentüren",null,null,null,null,"nein",{"$f":"IF(F5=\"ja\",L5,0)","v":0},null,null,null,null,2]
["Modernisierung der Leitungssysteme (Strom, Gas, Wasser, Abwasser)",null,null,null,null,"nein",0,null,null,null,null,2]
["Modernisierung der Heizungsanlage",null,null,null,null,"nein",0,null,null,null,null,2]
["Wärmedämmung der Außenwände",null,null,null,null,"nein",0,null,null,null,null,4]
["Modernisierung von Bädern ",null,null,null,null,"nein",0,null,null,null,null,2]
["Modernisierung des Innenausbaus, z.B. Decken, Fußböden, Treppen",null,null,null,null,"nein",0,null,null,null,null,2]
["Wesentliche Verbesserung der Grundrissgestaltung",null,null,null,null,"nein",0,null,null,null,null,2]
["Summe",null,null,null,null,null,{"$f":"SUM(G4:G11)","v":0},null,null,null,null,{"$f":"SUM(L4:L11)","v":20}]
[]
["Die Ermittlung der Restnutzungsdauer bei Modernisierungen soll pauschal erfolgen",null,null,null,null,null,"nein"]
["Modernisierungsgrad",null,null,null,null,null,"Punkte",null,null,"pauschale Angabe"]
["nicht modernisiert",null,null,null,null,null,0,"-",1]
["kleine Modernisierung im Rahmen der Instandhaltung",null,null,null,null,null,2,"-",5]
["mittlerer Modernisierungsgrad",null,null,null,null,null,6,"-",10]
["überwiegend modernisiert",null,null,null,null,null,11,"-",17]
["umfassend modernisiert",null,null,null,null,null,18,"-",20]
[]
["maßgebliche Punktzahl zur Ermittlung der Restnutzungsdauer",null,null,null,null,null,{"$f":"IF(G14=\"nein\",G12,SUM(J16:J20))","v":0}]
[]
[]
["Ermittlung der Restnutzungsdauer und des rechnerischen Baujahres"]
["Vorgaben","Stichtag",null,null,"nur das Jahr !",null,{"$f":"YEAR(EingabeMaske!D15)","v":2024}]
[null,"Baujahr",null,null,null,null,{"$f":"EingabeMaske!D16","v":1995}]
[null,"tatsächliches Alter",null,null,null,null,{"$f":"G26-G27","v":29},null,null,"Jahre"]
[null,"Bestimmung der Restnutzungsdauer bei Gesamtnutzungsdauer nach ImmoWertV"]
[null,"Gesamtnutzungsdauer",null,null,null,null,80,null,null,"Jahre"]
[null,"Restnutzungsdauer nach ImmoWertV",null,null,null,null,{"$f":"ROUND('RND ImmoWertV'!B10,0)","v":51},null,null,"Jahre"]
[null,"lineare Alterswertminderung",null,null,null,null,{"$f":"ROUND((G30-G31)/G30*100,2)","v":36.25},null,null,"%"]
[null,"fiktives Baujahr",null,null,null,null,{"$f":"G26-(G30-G31)","v":1995}]
[null,"Die Ermittlung des fiktiven Baujahrs wurde durchgeführt",null,null,false,null,{"$f":"IF(E34=TRUE,\"ja\",\"nein\")","v":"nein"}]

{"sheet":"Updates","index":4,"n_rows":3,"n_cols":3,"rows_kept":3,"cut":false,"hidden":false,"merged":[]}
["Nr.","Rechnerversion","Updates"]
[1,"WE-Rechner, Version 1 - LGMB 2025, Stand 04.2025","Umstellung des Rechners auf Anwendungsfunktion gemäß LGMG 2025"]
[2,"WE-Rechner, Version 2 - LGMB 2025, Stand 04.2025","Indexreihe 2025 und Schätzung 2026 eingefügt"]

{"sheet":"Vergleichsdaten LGMB 2025","index":5,"n_rows":76,"n_cols":15,"rows_kept":76,"cut":false,"hidden":true,"merged":[]}
["Anwendungsfunktion","VF (01.01.2024) = a + b x ASE + c x Gf + d x BWN(01.01.2024) + e x St + f x WF + g x WF² + h x Vs \n"]
[]
["Marktsegment",1,2,3,4,5,6,null,{"$f":"EingabeMaske!D32","v":0}]
["Koeffizienten"]
["a",{"$f":"Formel!B5","v":0},{"$f":"Formel!C5","v":0},{"$f":"Formel!D5","v":0},{"$f":"Formel!E5","v":0},{"$f":"Formel!F5","v":0},{"$f":"Formel!G5","v":0},null,{"$f":"LOOKUP(I3,B3:G3,B5:G5)","v":{"$error":"#N/A"}}]
["b",{"$f":"Formel!B6","v":0},{"$f":"Formel!C6","v":0},{"$f":"Formel!D6","v":0},{"$f":"Formel!E6","v":0},{"$f":"Formel!F6","v":0},{"$f":"Formel!G6","v":0},null,{"$f":"B6","v":0}]
["c",{"$f":"Formel!B7","v":0},{"$f":"Formel!C7","v":0},{"$f":"Formel!D7","v":0},{"$f":"Formel!E7","v":0},{"$f":"Formel!F7","v":0},{"$f":"Formel!G7","v":0},null,{"$f":"B7","v":0}]
["d",{"$f":"Formel!B8","v":0},{"$f":"Formel!C8","v":0},{"$f":"Formel!D8","v":0},{"$f":"Formel!E8","v":0},{"$f":"Formel!F8","v":0},{"$f":"Formel!G8","v":0},null,0]
["e",{"$f":"Formel!B9","v":0},{"$f":"Formel!C9","v":0},{"$f":"Formel!D9","v":0},{"$f":"Formel!E9","v":0},{"$f":"Formel!F9","v":0},{"$f":"Formel!G9","v":0},null,0]
["f",{"$f":"Formel!B10","v":0},{"$f":"Formel!C10","v":0},{"$f":"Formel!D10","v":0},{"$f":"Formel!E10","v":0},{"$f":"Formel!F10","v":0},{"$f":"Formel!G10","v":0},null,0]
["g",{"$f":"Formel!B11","v":0},{"$f":"Formel!C11","v":0},{"$f":"Formel!D11","v":0},{"$f":"Formel!E11","v":0},{"$f":"Formel!F11","v":0},{"$f":"Formel!G11","v":0},null,0]
["h",{"$f":"Formel!B12","v":0},{"$f":"Formel!C12","v":0},{"$f":"Formel!D12","v":0},{"$f":"Formel!E12","v":0},{"$f":"Formel!F12","v":0},{"$f":"Formel!G12","v":0},null,0]
[]
[]
[]
["Marktsegment",1,2,3,4,5,6,null,{"$f":"I3","v":0}]
["Vergleichsfaktoren für Garagen / Carports und Außenstellplätze",null,null,null,null,null,null,null,null,"Anzahl","Stellpätze",null,null,"nach Anwendungsfunktion"]
["Garage",6500,7000,7500,10000,12000,16000,null,{"$f":"LOOKUP(I16,B16:G16,B18:G18)","v":{"$error":"#N/A"}},{"$f":"EingabeMaske!B26","v":0},{"$f":"EingabeMaske!D26","v":0},{"$f":"I18*J18+IF(J18>0,0.75*(K18-J18)*I18,0)","v":{"$error":"#N/A"}},null,{"$f":"-21162.69475+5878.275748*LN(EingabeMaske!D22)","v":12365.711442638971},"Einzelgarage"]
["Carports",{"$f":"ROUND(0.85*B18,-2)","v":5500},{"$f":"ROUND(0.85*C18,-2)","v":6000},6400,8500,10200,13600,null,{"$f":"LOOKUP(I16,B16:G16,B19:G19)","v":{"$error":"#N/A"}},{"$f":"EingabeMaske!B27","v":0},{"$f":"EingabeMaske!D27","v":0},{"$f":"I19*J19+IF(J19>0,0.75*(K19-J19)*I19,0)","v":{"$error":"#N/A"}},null,{"$f":"-11875.37426+4017.87749*LN(EingabeMaske!D22)","v":11041.724952777644},"Tiefgarage"]
["Außenstellplätze",2500,3000,5300,7300,8100,9400,null,{"$f":"LOOKUP(I16,B16:G16,B20:G20)","v":{"$error":"#N/A"}},{"$f":"EingabeMaske!D28","v":0},null,{"$f":"I20*J20","v":{"$error":"#N/A"}},null,{"$f":"-4652.85034+2120.189089*LN(EingabeMaske!D22)","v":7440.2470287954957},"Außenstellplatz (befestigt)"]
[]
["Dropdown"]
["Gebäudestandard nach fiktivem Baujahr übernehmen"]
["Gebäudestandard nach fiktivem Baujahr nicht übernehmen"]
[]
["Dropdown"]
["ja"]
["nein"]
[]
[]
[]
["Baujahr","Standardstufe"]
[{"$f":"EingabeMaske!B39","v":"liegt nicht vor"},{"$f":"IF(RND!G34=\"nein\",\"-\",IF(A33<=1976,2,IF(A33>=2016,4.5,VLOOKUP(A33,A35:B75,2,FALSE))))","v":"-"}]
[]
["< =1975",2]
[1976,2]
[{"$f":"A36+1","v":1977},{"$f":"ROUND(B$35+D37/D$45*0.5,1)","v":2.1},null,1]
[1978,{"$f":"ROUND(B$35+D38/D$45*0.5,1)","v":2.1},null,{"$f":"D37+1","v":2}]
[1979,2.2000000000000002,null,3]
[1980,2.2000000000000002,null,4]
[1981,2.2999999999999998,null,5]
[1982,2.2999999999999998,null,6]
[1983,2.4,null,7]
[1984,2.4,null,8]
[1985,2.5,null,9]
[1986,2.5,null,10]
[1987,{"$f":"ROUND(B$45+D47/D$55*0.5,1)","v":2.6},null,1]
[1988,{"$f":"ROUND(B$45+D48/D$55*0.5,1)","v":2.6},null,{"$f":"D47+1","v":2}]
[1989,2.7,null,3]
[1990,2.7,null,4]
[1991,2.8,null,5]
[1992,2.8,null,6]
[1993,2.9,null,7]
[1994,2.9,null,8]
[1995,3,null,9]
[1996,3,null,10]
[1997,{"$f":"ROUND(B$55+D57/D$65*1,1)","v":3.1},null,1]
[1998,{"$f":"ROUND(B$55+D58/D$65*1,1)","v":3.2},null,{"$f":"D57+1","v":2}]
[1999,3.3,null,3]
[2000,3.4,null,4]
[2001,3.6,null,5]
[2002,3.7,null,6]
[2003,3.8,null,7]
[2004,3.9,null,8]
[2005,4,null,9]
[2006,4,null,10]
[2007,{"$f":"ROUND(B$65+D67/D$75*0.5,1)","v":4.0999999999999996},null,1]
[2008,{"$f":"ROUND(B$65+D68/D$75*0.5,1)","v":4.0999999999999996},null,2]
[2009,{"$f":"ROUND(B$65+D69/D$75*0.5,1)","v":4.2},null,3]
[2010,4.2,null,4]
[2011,4.3,null,5]
[2012,4.3,null,6]
[2013,4.4000000000000004,null,7]
[2014,4.4000000000000004,null,8]
[2015,4.5,null,9]
[2016,4.5,null,10]

{"sheet":"Formel","index":6,"n_rows":0,"n_cols":0,"rows_kept":0,"cut":false,"hidden":true,"merged":[]}

{"sheet":"UK","index":7,"n_rows":0,"n_cols":0,"rows_kept":0,"cut":false,"hidden":true,"merged":[[12,0,12,1],[0,0,1,1],[2,0,2,1],[3,0,3,1],[4,0,4,1],[5,0,5,1],[6,0,6,1],[7,0,7,1],[8,0,8,1],[9,0,9,1],[10,0,10,1],[11,0,11,1],[26,0,26,1],[13,0,13,1],[14,0,14,1],[15,0,15,1],[17,0,18,1],[19,0,19,1],[20,0,20,1],[21,0,21,1],[22,0,22,1],[23,0,23,1],[24,0,24,1],[25,0,25,1],[40,0,40,1],[27,0,27,1],[28,0,28,1],[29,0,29,1],[30,0,30,1],[31,0,31,1],[32,0,32,1],[34,0,35,1],[36,0,36,1],[37,0,37,1],[38,0,38,1],[39,0,39,1],[54,0,54,1],[41,0,41,1],[42,0,42,1],[44,0,45,1],[46,0,46,1],[47,0,47,1],[48,0,48,1],[49,0,49,1],[50,0,50,1],[51,0,51,1],[52,0,52,1],[53,0,53,1],[68,0,68,1],[55,0,55,1],[56,0,56,1],[57,0,57,1],[58,0,58,1],[60,0,61,1],[62,0,62,1],[63,0,63,1],[64,0,64,1],[65,0,65,1],[66,0,66,1],[67,0,67,1],[80,0,80,1],[69,0,69,1],[70,0,70,1],[71,0,71,1],[72,0,72,1],[73,0,73,1],[74,0,74,1],[75,0,75,1],[76,0,76,1],[77,0,77,1],[78,0,78,1],[79,0,79,1],[92,0,92,1],[81,0,81,1],[82,0,82,1],[83,0,83,1],[84,0,84,1],[85,0,85,1],[86,0,86,1],[87,0,87,1],[88,0,88,1],[89,0,89,1],[90,0,90,1],[91,0,91,1]]}

{"sheet":"Vergleichsfaktoren 2025 (2)","index":8,"n_rows":3022,"n_cols":8,"rows_kept":3022,"cut":false,"hidden":true,"merged":[[1,4,1,5],[0,1,0,7],[2,1,2,7],[3,1,3,7],[4,1,4,7]]}
[null,"Vergleichsfaktoren (VF) für Wohnungseigentume im Weiterverkauf"]
[null,null,null,"Stichtag ","2024-01-01"]
[null,"Modell s. LGMB 2025, Kap. 4.4.1.2 - © Oberer Gutachterausschuss für Grundstückswerte Rheinland-Pfalz"]
[null,"Kurzbeschreibung des Richtwertobjekts: 10 Einheiten im Objekt, Grundstücksgröße 1.300 m², mittlerer Standard, Wohnfäche 80 m², Geb.Std. 3"]
[null,"Hinweis: Sollte eine Gemarkung nicht nachgewiesen sein, kann eine vergleichbare Gemarkung desselben Marktsegments herangezogen werden. "]
["Ergänzung LfSt"]
["Gemeinde / Gemarkung / Landkreis bzw. Stadt","Nr.","Gemarkung","Gemeinde","Landkreis/kreisfreie Stadt","Markt-segment Nr.","BWN €/m² Grdst.fl.","VF €/m² Wohnfl."]
[{"$f":"D8&\" / \"&C8&\" / \"&E8","v":" /  / "}]
[{"$f":"D9&\" / \"&C9&\" / \"&E9","v":" /  / "}]
[" /  / "]
[" /  / "]
[" /  / "]
[" /  / "]
[" /  / "]
[" /  / "]
[" /  / "]
[" /  / "]
[" /  / "]
[" /  / "]
[" /  / "]
[" /  / "]
[" /  / "]
[" /  / "]
[" /  / "]
[" /  / "]
[" /  / "]
[" /  / "]
[" /  / "]
[" /  / "]
[" /  / "]
[" /  / "]
[" /  / "]
[" /  / "]
[" /  / "]
[" /  / "]
[" /  / "]
[" /  / "]
[" /  / "]
[" /  / "]
[" /  / "]
[" /  / "]
[" /  / "]
[" /  / "]
[" /  / "]
[" /  / "]
[" /  / "]
[" /  / "]
[" /  / "]
[" /  / "]
[" /  / "]
[" /  / "]
[" /  / "]
[" /  / "]
[" /  / "]
[" /  / "]
[" /  / "]
[" /  / "]
[" /  / "]
[" /  / "]
[" /  / "]
[" /  / "]
[" /  / "]
[" /  / "]
[" /  / "]
[" /  / "]
[" /  / "]
[" /  / "]
[" /  / "]
[" /  / "]
[" /  / "]
[" /  / "]
[" /  / "]
[{"$f":"D73&\" / \"&C73&\" / \"&E73","v":" /  / "}]
[" /  / "]
[" /  / "]
[" /  / "]
[" /  / "]
[" /  / "]
[" /  / "]
[" /  / "]
[" /  / "]
[" /  / "]
[" /  / "]
[" /  / "]
[" /  / "]
[" /  / "]
[" /  / "]
[" /  / "]
[" /  / "]
[" /  / "]
[" /  / "]
[" /  / "]
[" /  / "]
[" /  / "]
[" /  / "]
[" /  / "]
[" /  / "]
[" /  / "]
[" /  / "]
[" /  / "]
[" /  / "]
[" /  / "]
[" /  / "]
[" /  / "]
[" /  / "]
[" /  / "]
[" /  / "]
[" /  / "]
[" /  / "]
[" /  / "]
[" /  / "]
[" /  / "]
[" /  / "]
[" /  / "]
[" /  / "]
[" /  / "]
[" /  / "]
[" /  / "]
[" /  / "]
[" /  / "]
[" /  / "]
[" /  / "]
[" /  / "]
[" /  / "]
[" /  / "]
[" /  / "]
[" /  / "]
[" /  / "]
[" /  / "]
[" /  / "]
[" /  / "]
[" /  / "]
[" /  / "]
[" /  / "]
[" /  / "]
[" /  / "]
[{"$f":"D137&\" / \"&C137&\" / \"&E137","v":" /  / "}]
[" /  / "]
[" /  / "]
[" /  / "]
[" /  / "]
[" /  / "]
[" /  / "]
[" /  / "]
[" /  / "]
[" /  / "]
[" /  / "]
[" /  / "]
[" /  / "]
[" /  / "]
[" /  / "]
[" /  / "]
[" /  / "]
[" /  / "]
[" /  / "]
[" /  / "]
[" /  / "]
[" /  / "]
[" /  / "]
[" /  / "]
[" /  / "]
[" /  / "]
[" /  / "]
[" /  / "]
[" /  / "]
[" /  / "]
[" /  / "]
[" /  / "]
[" /  / "]
[" /  / "]
[" /  / "]
[" /  / "]
[" /  / "]
[" /  / "]
[" /  / "]
[" /  / "]
[" /  / "]
[" /  / "]
[" /  / "]
[" /  / "]
[" /  / "]
[" /  / "]
[" /  / "]
[" /  / "]
[" /  / "]
[" /  / "]
[" /  / "]
[" /  / "]
[" /  / "]
[" /  / "]
[" /  / "]
[" /  / "]
[" /  / "]
[" /  / "]
[" /  / "]
[" /  / "]
[" /  / "]
[" /  / "]
[" /  / "]
[" /  / "]
[{"$f":"D201&\" / \"&C201&\" / \"&E201","v":" /  / "}]
[" /  / "]
[" /  / "]
[" /  / "]
[" /  / "]
[" /  / "]
[" /  / "]
[" /  / "]
[" /  / "]
[" /  / "]
[" /  / "]
[" /  / "]
[" /  / "]
[" /  / "]
[" /  / "]
[" /  / "]
[" /  / "]
[" /  / "]
[" /  / "]
[" /  / "]
[" /  / "]
[" /  / "]
[" /  / "]
[" /  / "]
[" /  / "]
[" /  / "]
[" /  / "]
[" /  / "]
[" /  / "]
[" /  / "]
[" /  / "]
[" /  / "]
[" /  / "]
[" /  / "]
[" /  / "]
[" /  / "]
[" /  / "]
[" /  / "]
[" /  / "]
[" /  / "]
[" /  / "]
[" /  / "]
[" /  / "]
[" /  / "]
[" /  / "]
[" /  / "]
[" /  / "]
[" /  / "]
[" /  / "]
[" /  / "]
[" /  / "]
[" /  / "]
[" /  / "]
[" /  / "]
[" /  / "]
[" /  / "]
[" /  / "]
[" /  / "]
[" /  / "]
[" /  / "]
[" /  / "]
[" /  / "]
[" /  / "]
[" /  / "]
[{"$f":"D265&\" / \"&C265&\" / \"&E265","v":" /  / "}]
[" /  / "]
[" /  / "]
[" /  / "]
[" /  / "]
[" /  / "]
[" /  / "]
[" /  / "]
[" /  / "]
[" /  / "]
[" /  / "]
[" /  / "]
[" /  / "]
[" /  / "]
[" /  / "]
[" /  / "]
[" /  / "]
[" /  / "]
[" /  / "]
[" /  / "]
[" /  / "]
[" /  / "]
[" /  / "]
[" /  / "]
[" /  / "]
[" /  / "]
[" /  / "]
[" /  / "]
[" /  / "]
[" /  / "]
[" /  / "]
[" /  / "]
[" /  / "]
[" /  / "]
[" /  / "]
[" /  / "]
[" /  / "]
[" /  / "]
[" /  / "]
[" /  / "]
[" /  / "]
[" /  / "]
[" /  / "]
[" /  / "]
[" /  / "]
[" /  / "]
[" /  / "]
[" /  / "]
[" /  / "]
[" /  / "]
[" /  / "]
[" /  / "]
[" /  / "]
[" /  / "]
[" /  / "]
[" /  / "]
[" /  / "]
[" /  / "]
[" /  / "]
[" /  / "]
[" /  / "]
[" /  / "]
[" /  / "]
[" /  / "]
[{"$f":"D329&\" / \"&C329&\" / \"&E329","v":" /  / "}]
[" /  / "]
[" /  / "]
[" /  / "]
[" /  / "]
[" /  / "]
[" /  / "]
[" /  / "]
[" /  / "]
[" /  / "]
[" /  / "]
[" /  / "]
[" /  / "]
[" /  / "]
[" /  / "]
[" /  / "]
[" /  / "]
[" /  / "]
[" /  / "]
[" /  / "]
[" /  / "]
[" /  / "]
[" /  / "]
[" /  / "]
[" /  / "]
[" /  / "]
[" /  / "]
[" /  / "]
[" /  / "]
[" /  / "]
[" /  / "]
[" /  / "]
[" /  / "]
[" /  / "]
[" /  / "]
[" /  / "]
[" /  / "]
[" /  / "]
[" /  / "]
[" /  / "]
[" /  / "]
[" /  / "]
[" /  / "]
[" /  / "]
[" /  / "]
[" /  / "]
[" /  / "]
[" /  / "]
[" /  / "]
[" /  / "]
[" /  / "]
[" /  / "]
[" /  / "]
[" /  / "]
[" /  / "]
[" /  / "]
[" /  / "]
[" /  / "]
[" /  / "]
[" /  / "]
[" /  / "]
[" /  / "]
[" /  / "]
[" /  / "]
[{"$f":"D393&\" / \"&C393&\" / \"&E393","v":" /  / "}]
[" /  / "]
[" /  / "]
[" /  / "]
[" /  / "]
[" /  / "]
[" /  / "]
[" /  / "]
[" /  / "]
[" /  / "]
[" /  / "]
[" /  / "]
[" /  / "]
[" /  / "]
[" /  / "]
[" /  / "]
[" /  / "]
[" /  / "]
[" /  / "]
[" /  / "]
[" /  / "]
[" /  / "]
[" /  / "]
[" /  / "]
[" /  / "]
[" /  / "]
[" /  / "]
[" /  / "]
[" /  / "]
[" /  / "]
[" /  / "]
[" /  / "]
[" /  / "]
[" /  / "]
[" /  / "]
[" /  / "]
[" /  / "]
[" /  / "]
[" /  / "]
[" /  / "]
[" /  / "]
[" /  / "]
[" /  / "]
[" /  / "]
[" /  / "]
[" /  / "]
[" /  / "]
[" /  / "]
[" /  / "]
[" /  / "]
[" /  / "]
[" /  / "]
[" /  / "]
[" /  / "]
[" /  / "]
[" /  / "]
[" /  / "]
[" /  / "]
[" /  / "]
[" /  / "]
[" /  / "]
[" /  / "]
[" /  / "]
[" /  / "]
[{"$f":"D457&\" / \"&C457&\" / \"&E457","v":" /  / "}]
[" /  / "]
[" /  / "]
[" /  / "]
[" /  / "]
[" /  / "]
[" /  / "]
[" /  / "]
[" /  / "]
[" /  / "]
[" /  / "]
[" /  / "]
[" /  / "]
[" /  / "]
[" /  / "]
[" /  / "]
[" /  / "]
[" /  / "]
[" /  / "]
[" /  / "]
[" /  / "]
[" /  / "]
[" /  / "]
[" /  / "]
[" /  / "]
[" /  / "]
[" /  / "]
[" /  / "]
[" /  / "]
[" /  / "]
[" /  / "]
[" /  / "]
[" /  / "]
[" /  / "]
[" /  / "]
[" /  / "]
[" /  / "]
[" /  / "]
[" /  / "]
[" /  / "]
[" /  / "]
[" /  / "]
[" /  / "]
[" /  / "]
[" /  / "]
[" /  / "]
[" /  / "]
[" /  / "]
[" /  / "]
[" /  / "]
[" /  / "]
[" /  / "]
[" /  / "]
[" /  / "]
[" /  / "]
[" /  / "]
[" /  / "]
[" /  / "]
[" /  / "]
[" /  / "]
[" /  / "]
[" /  / "]
[" /  / "]
[" /  / "]
[{"$f":"D521&\" / \"&C521&\" / \"&E521","v":" /  / "}]
[" /  / "]
[" /  / "]
[" /  / "]
[" /  / "]
[" /  / "]
[" /  / "]
[" /  / "]
[" /  / "]
[" /  / "]
[" /  / "]
[" /  / "]
[" /  / "]
[" /  / "]
[" /  / "]
[" /  / "]
[" /  / "]
[" /  / "]
[" /  / "]
[" /  / "]
[" /  / "]
[" /  / "]
[" /  / "]
[" /  / "]
[" /  / "]
[" /  / "]
[" /  / "]
[" /  / "]
[" /  / "]
[" /  / "]
[" /  / "]
[" /  / "]
[" /  / "]
[" /  / "]
[" /  / "]
[" /  / "]
[" /  / "]
[" /  / "]
[" /  / "]
[" /  / "]
[" /  / "]
[" /  / "]
[" /  / "]
[" /  / "]
[" /  / "]
[" /  / "]
[" /  / "]
[" /  / "]
[" /  / "]
[" /  / "]
[" /  / "]
[" /  / "]
[" /  / "]
[" /  / "]
[" /  / "]
[" /  / "]
[" /  / "]
[" /  / "]
[" /  / "]
[" /  / "]
[" /  / "]
[" /  / "]
[" /  / "]
[" /  / "]
[{"$f":"D585&\" / \"&C585&\" / \"&E585","v":" /  / "}]
[" /  / "]
[" /  / "]
[" /  / "]
[" /  / "]
[" /  / "]
[" /  / "]
[" /  / "]
[" /  / "]
[" /  / "]
[" /  / "]
[" /  / "]
[" /  / "]
[" /  / "]
[" /  / "]
[" /  / "]
[" /  / "]
[" /  / "]
[" /  / "]
[" /  / "]
[" /  / "]
[" /  / "]
[" /  / "]
[" /  / "]
[" /  / "]
[" /  / "]
[" /  / "]
[" /  / "]
[" /  / "]
[" /  / "]
[" /  / "]
[" /  / "]
[" /  / "]
[" /  / "]
[" /  / "]
[" /  / "]
[" /  / "]
[" /  / "]
[" /  / "]
[" /  / "]
[" /  / "]
[" /  / "]
[" /  / "]
[" /  / "]
[" /  / "]
[" /  / "]
[" /  / "]
[" /  / "]
[" /  / "]
[" /  / "]
[" /  / "]
[" /  / "]
[" /  / "]
[" /  / "]
[" /  / "]
[" /  / "]
[" /  / "]
[" /  / "]
[" /  / "]
[" /  / "]
[" /  / "]
[" /  / "]
[" /  / "]
[" /  / "]
[{"$f":"D649&\" / \"&C649&\" / \"&E649","v":" /  / "}]
[" /  / "]
[" /  / "]
[" /  / "]
[" /  / "]
[" /  / "]
[" /  / "]
[" /  / "]
[" /  / "]
[" /  / "]
[" /  / "]
[" /  / "]
[" /  / "]
[" /  / "]
[" /  / "]
[" /  / "]
[" /  / "]
[" /  / "]
[" /  / "]
[" /  / "]
[" /  / "]
[" /  / "]
[" /  / "]
[" /  / "]
[" /  / "]
[" /  / "]
[" /  / "]
[" /  / "]
[" /  / "]
[" /  / "]
[" /  / "]
[" /  / "]
[" /  / "]
[" /  / "]
[" /  / "]
[" /  / "]
[" /  / "]
[" /  / "]
[" /  / "]
[" /  / "]
[" /  / "]
[" /  / "]
[" /  / "]
[" /  / "]
[" /  / "]
[" /  / "]
[" /  / "]
[" /  / "]
[" /  / "]
[" /  / "]
[" /  / "]
[" /  / "]
[" /  / "]
[" /  / "]
[" /  / "]
[" /  / "]
[" /  / "]
[" /  / "]
[" /  / "]
[" /  / "]
[" /  / "]
[" /  / "]
[" /  / "]
[" /  / "]
[{"$f":"D713&\" / \"&C713&\" / \"&E713","v":" /  / "}]
[" /  / "]
[" /  / "]
[" /  / "]
[" /  / "]
[" /  / "]
[" /  / "]
[" /  / "]
[" /  / "]
[" /  / "]
[" /  / "]
[" /  / "]
[" /  / "]
[" /  / "]
[" /  / "]
[" /  / "]
[" /  / "]
[" /  / "]
[" /  / "]
[" /  / "]
[" /  / "]
[" /  / "]
[" /  / "]
[" /  / "]
[" /  / "]
[" /  / "]
[" /  / "]
[" /  / "]
[" /  / "]
[" /  / "]
[" /  / "]
[" /  / "]
[" /  / "]
[" /  / "]
[" /  / "]
[" /  / "]
[" /  / "]
[" /  / "]
[" /  / "]
[" /  / "]
[" /  / "]
[" /  / "]
[" /  / "]
[" /  / "]
[" /  / "]
[" /  / "]
[" /  / "]
[" /  / "]
[" /  / "]
[" /  / "]
[" /  / "]
[" /  / "]
[" /  / "]
[" /  / "]
[" /  / "]
[" /  / "]
[" /  / "]
[" /  / "]
[" /  / "]
[" /  / "]
[" /  / "]
[" /  / "]
[" /  / "]
[" /  / "]
[{"$f":"D777&\" / \"&C777&\" / \"&E777","v":" /  / "}]
[" /  / "]
[" /  / "]
[" /  / "]
[" /  / "]
[" /  / "]
[" /  / "]
[" /  / "]
[" /  / "]
[" /  / "]
[" /  / "]
[" /  / "]
[" /  / "]
[" /  / "]
[" /  / "]
[" /  / "]
[" /  / "]
[" /  / "]
[" /  / "]
[" /  / "]
[" /  / "]
[" /  / "]
[" /  / "]
[" /  / "]
[" /  / "]
[" /  / "]
[" /  / "]
[" /  / "]
[" /  / "]
[" /  / "]
[" /  / "]
[" /  / "]
[" /  / "]
[" /  / "]
[" /  / "]
[" /  / "]
[" /  / "]
[" /  / "]
[" /  / "]
[" /  / "]
[" /  / "]
[" /  / "]
[" /  / "]
[" /  / "]
[" /  / "]
[" /  / "]
[" /  / "]
[" /  / "]
[" /  / "]
[" /  / "]
[" /  / "]
[" /  / "]
[" /  / "]
[" /  / "]
[" /  / "]
[" /  / "]
[" /  / "]
[" /  / "]
[" /  / "]
[" /  / "]
[" /  / "]
[" /  / "]
[" /  / "]
[" /  / "]
[{"$f":"D841&\" / \"&C841&\" / \"&E841","v":" /  / "}]
[" /  / "]
[" /  / "]
[" /  / "]
[" /  / "]
[" /  / "]
[" /  / "]
[" /  / "]
[" /  / "]
[" /  / "]
[" /  / "]
[" /  / "]
[" /  / "]
[" /  / "]
[" /  / "]
[" /  / "]
[" /  / "]
[" /  / "]
[" /  / "]
[" /  / "]
[" /  / "]
[" /  / "]
[" /  / "]
[" /  / "]
[" /  / "]
[" /  / "]
[" /  / "]
[" /  / "]
[" /  / "]
[" /  / "]
[" /  / "]
[" /  / "]
[" /  / "]
[" /  / "]
[" /  / "]
[" /  / "]
[" /  / "]
[" /  / "]
[" /  / "]
[" /  / "]
[" /  / "]
[" /  / "]
[" /  / "]
[" /  / "]
[" /  / "]
[" /  / "]
[" /  / "]
[" /  / "]
[" /  / "]
[" /  / "]
[" /  / "]
[" /  / "]
[" /  / "]
[" /  / "]
[" /  / "]
[" /  / "]
[" /  / "]
[" /  / "]
[" /  / "]
[" /  / "]
[" /  / "]
[" /  / "]
[" /  / "]
[" /  / "]
[{"$f":"D905&\" / \"&C905&\" / \"&E905","v":" /  / "}]
[" /  / "]
[" /  / "]
[" /  / "]
[" /  / "]
[" /  / "]
[" /  / "]
[" /  / "]
[" /  / "]
[" /  / "]
[" /  / "]
[" /  / "]
[" /  / "]
[" /  / "]
[" /  / "]
[" /  / "]
[" /  / "]
[" /  / "]
[" /  / "]
[" /  / "]
[" /  / "]
[" /  / "]
[" /  / "]
[" /  / "]
[" /  / "]
[" /  / "]
[" /  / "]
[" /  / "]
[" /  / "]
[" /  / "]
[" /  / "]
[" /  / "]
[" /  / "]
[" /  / "]
[" /  / "]
[" /  / "]
[" /  / "]
[" /  / "]
[" /  / "]
[" /  / "]
[" /  / "]
[" /  / "]
[" /  / "]
[" /  / "]
[" /  / "]
[" /  / "]
[" /  / "]
[" /  / "]
[" /  / "]
[" /  / "]
[" /  / "]
[" /  / "]
[" /  / "]
[" /  / "]
[" /  / "]
[" /  / "]
[" /  / "]
[" /  / "]
[" /  / "]
[" /  / "]
[" /  / "]
[" /  / "]
[" /  / "]
[" /  / "]
[{"$f":"D969&\" / \"&C969&\" / \"&E969","v":" /  / "}]
[" /  / "]
[" /  / "]
[" /  / "]
[" /  / "]
[" /  / "]
[" /  / "]
[" /  / "]
[" /  / "]
[" /  / "]
[" /  / "]
[" /  / "]
[" /  / "]
[" /  / "]
[" /  / "]
[" /  / "]
[" /  / "]
[" /  / "]
[" /  / "]
[" /  / "]
[" /  / "]
[" /  / "]
[" /  / "]
[" /  / "]
[" /  / "]
[" /  / "]
[" /  / "]
[" /  / "]
[" /  / "]
[" /  / "]
[" /  / "]
[" /  / "]
[" /  / "]
[" /  / "]
[" /  / "]
[" /  / "]
[" /  / "]
[" /  / "]
[" /  / "]
[" /  / "]
[" /  / "]
[" /  / "]
[" /  / "]
[" /  / "]
[" /  / "]
[" /  / "]
[" /  / "]
[" /  / "]
[" /  / "]
[" /  / "]
[" /  / "]
[" /  / "]
[" /  / "]
[" /  / "]
[" /  / "]
[" /  / "]
[" /  / "]
[" /  / "]
[" /  / "]
[" /  / "]
[" /  / "]
[" /  / "]
[" /  / "]
[" /  / "]
[{"$f":"D1033&\" / \"&C1033&\" / \"&E1033","v":" /  / "}]
[" /  / "]
[" /  / "]
[" /  / "]
[" /  / "]
[" /  / "]
[" /  / "]
[" /  / "]
[" /  / "]
[" /  / "]
[" /  / "]
[" /  / "]
[" /  / "]
[" /  / "]
[" /  / "]
[" /  / "]
[" /  / "]
[" /  / "]
[" /  / "]
[" /  / "]
[" /  / "]
[" /  / "]
[" /  / "]
[" /  / "]
[" /  / "]
[" /  / "]
[" /  / "]
[" /  / "]
[" /  / "]
[" /  / "]
[" /  / "]
[" /  / "]
[" /  / "]
[" /  / "]
[" /  / "]
[" /  / "]
[" /  / "]
[" /  / "]
[" /  / "]
[" /  / "]
[" /  / "]
[" /  / "]
[" /  / "]
[" /  / "]
[" /  / "]
[" /  / "]
[" /  / "]
[" /  / "]
[" /  / "]
[" /  / "]
[" /  / "]
[" /  / "]
[" /  / "]
[" /  / "]
[" /  / "]
[" /  / "]
[" /  / "]
[" /  / "]
[" /  / "]
[" /  / "]
[" /  / "]
[" /  / "]
[" /  / "]
[" /  / "]
[{"$f":"D1097&\" / \"&C1097&\" / \"&E1097","v":" /  / "}]
[" /  / "]
[" /  / "]
[" /  / "]
[" /  / "]
[" /  / "]
[" /  / "]
[" /  / "]
[" /  / "]
[" /  / "]
[" /  / "]
[" /  / "]
[" /  / "]
[" /  / "]
[" /  / "]
[" /  / "]
[" /  / "]
[" /  / "]
[" /  / "]
[" /  / "]
[" /  / "]
[" /  / "]
[" /  / "]
[" /  / "]
[" /  / "]
[" /  / "]
[" /  / "]
[" /  / "]
[" /  / "]
[" /  / "]
[" /  / "]
[" /  / "]
[" /  / "]
[" /  / "]
[" /  / "]
[" /  / "]
[" /  / "]
[" /  / "]
[" /  / "]
[" /  / "]
[" /  / "]
[" /  / "]
[" /  / "]
[" /  / "]
[" /  / "]
[" /  / "]
[" /  / "]
[" /  / "]
[" /  / "]
[" /  / "]
[" /  / "]
[" /  / "]
[" /  / "]
[" /  / "]
[" /  / "]
[" /  / "]
[" /  / "]
[" /  / "]
[" /  / "]
[" /  / "]
[" /  / "]
[" /  / "]
[" /  / "]
[" /  / "]
[{"$f":"D1161&\" / \"&C1161&\" / \"&E1161","v":" /  / "}]
[" /  / "]
[" /  / "]
[" /  / "]
[" /  / "]
[" /  / "]
[" /  / "]
[" /  / "]
[" /  / "]
[" /  / "]
[" /  / "]
[" /  / "]
[" /  / "]
[" /  / "]
[" /  / "]
[" /  / "]
[" /  / "]
[" /  / "]
[" /  / "]
[" /  / "]
[" /  / "]
[" /  / "]
[" /  / "]
[" /  / "]
[" /  / "]
[" /  / "]
[" /  / "]
[" /  / "]
[" /  / "]
[" /  / "]
[" /  / "]
[" /  / "]
[" /  / "]
[" /  / "]
[" /  / "]
[" /  / "]
[" /  / "]
[" /  / "]
[" /  / "]
[" /  / "]
[" /  / "]
[" /  / "]
[" /  / "]
[" /  / "]
[" /  / "]
[" /  / "]
[" /  / "]
[" /  / "]
[" /  / "]
[" /  / "]
[" /  / "]
[" /  / "]
[" /  / "]
[" /  / "]
[" /  / "]
[" /  / "]
[" /  / "]
[" /  / "]
[" /  / "]
[" /  / "]
[" /  / "]
[" /  / "]
[" /  / "]
[" /  / "]
[{"$f":"D1225&\" / \"&C1225&\" / \"&E1225","v":" /  / "}]
[" /  / "]
[" /  / "]
[" /  / "]
[" /  / "]
[" /  / "]
[" /  / "]
[" /  / "]
[" /  / "]
[" /  / "]
[" /  / "]
[" /  / "]
[" /  / "]
[" /  / "]
[" /  / "]
[" /  / "]
[" /  / "]
[" /  / "]
[" /  / "]
[" /  / "]
[" /  / "]
[" /  / "]
[" /  / "]
[" /  / "]
[" /  / "]
[" /  / "]
[" /  / "]
[" /  / "]
[" /  / "]
[" /  / "]
[" /  / "]
[" /  / "]
[" /  / "]
[" /  / "]
[" /  / "]
[" /  / "]
[" /  / "]
[" /  / "]
[" /  / "]
[" /  / "]
[" /  / "]
[" /  / "]
[" /  / "]
[" /  / "]
[" /  / "]
[" /  / "]
[" /  / "]
[" /  / "]
[" /  / "]
[" /  / "]
[" /  / "]
[" /  / "]
[" /  / "]
[" /  / "]
[" /  / "]
[" /  / "]
[" /  / "]
[" /  / "]
[" /  / "]
[" /  / "]
[" /  / "]
[" /  / "]
[" /  / "]
[" /  / "]
[{"$f":"D1289&\" / \"&C1289&\" / \"&E1289","v":" /  / "}]
[" /  / "]
[" /  / "]
[" /  / "]
[" /  / "]
[" /  / "]
[" /  / "]
[" /  / "]
[" /  / "]
[" /  / "]
[" /  / "]
[" /  / "]
[" /  / "]
[" /  / "]
[" /  / "]
[" /  / "]
[" /  / "]
[" /  / "]
[" /  / "]
[" /  / "]
[" /  / "]
[" /  / "]
[" /  / "]
[" /  / "]
[" /  / "]
[" /  / "]
[" /  / "]
[" /  / "]
[" /  / "]
[" /  / "]
[" /  / "]
[" /  / "]
[" /  / "]
[" /  / "]
[" /  / "]
[" /  / "]
[" /  / "]
[" /  / "]
[" /  / "]
[" /  / "]
[" /  / "]
[" /  / "]
[" /  / "]
[" /  / "]
[" /  / "]
[" /  / "]
[" /  / "]
[" /  / "]
[" /  / "]
[" /  / "]
[" /  / "]
[" /  / "]
[" /  / "]
[" /  / "]
[" /  / "]
[" /  / "]
[" /  / "]
[" /  / "]
[" /  / "]
[" /  / "]
[" /  / "]
[" /  / "]
[" /  / "]
[" /  / "]
[{"$f":"D1353&\" / \"&C1353&\" / \"&E1353","v":" /  / "}]
[" /  / "]
[" /  / "]
[" /  / "]
[" /  / "]
[" /  / "]
[" /  / "]
[" /  / "]
[" /  / "]
[" /  / "]
[" /  / "]
[" /  / "]
[" /  / "]
[" /  / "]
[" /  / "]
[" /  / "]
[" /  / "]
[" /  / "]
[" /  / "]
[" /  / "]
[" /  / "]
[" /  / "]
[" /  / "]
[" /  / "]
[" /  / "]
[" /  / "]
[" /  / "]
[" /  / "]
[" /  / "]
[" /  / "]
[" /  / "]
[" /  / "]
[" /  / "]
[" /  / "]
[" /  / "]
[" /  / "]
[" /  / "]
[" /  / "]
[" /  / "]
[" /  / "]
[" /  / "]
[" /  / "]
[" /  / "]
[" /  / "]
[" /  / "]
[" /  / "]
[" /  / "]
[" /  / "]
[" /  / "]
[" /  / "]
[" /  / "]
[" /  / "]
[" /  / "]
[" /  / "]
[" /  / "]
[" /  / "]
[" /  / "]
[" /  / "]
[" /  / "]
[" /  / "]
[" /  / "]
[" /  / "]
[" /  / "]
[" /  / "]
[{"$f":"D1417&\" / \"&C1417&\" / \"&E1417","v":" /  / "}]
[" /  / "]
[" /  / "]
[" /  / "]
[" /  / "]
[" /  / "]
[" /  / "]
[" /  / "]
[" /  / "]
[" /  / "]
[" /  / "]
[" /  / "]
[" /  / "]
[" /  / "]
[" /  / "]
[" /  / "]
[" /  / "]
[" /  / "]
[" /  / "]
[" /  / "]
[" /  / "]
[" /  / "]
[" /  / "]
[" /  / "]
[" /  / "]
[" /  / "]
[" /  / "]
[" /  / "]
[" /  / "]
[" /  / "]
[" /  / "]
[" /  / "]
[" /  / "]
[" /  / "]
[" /  / "]
[" /  / "]
[" /  / "]
[" /  / "]
[" /  / "]
[" /  / "]
[" /  / "]
[" /  / "]
[" /  / "]
[" /  / "]
[" /  / "]
[" /  / "]
[" /  / "]
[" /  / "]
[" /  / "]
[" /  / "]
[" /  / "]
[" /  / "]
[" /  / "]
[" /  / "]
[" /  / "]
[" /  / "]
[" /  / "]
[" /  / "]
[" /  / "]
[" /  / "]
[" /  / "]
[" /  / "]
[" /  / "]
[" /  / "]
[{"$f":"D1481&\" / \"&C1481&\" / \"&E1481","v":" /  / "}]
[" /  / "]
[" /  / "]
[" /  / "]
[" /  / "]
[" /  / "]
[" /  / "]
[" /  / "]
[" /  / "]
[" /  / "]
[" /  / "]
[" /  / "]
[" /  / "]
[" /  / "]
[" /  / "]
[" /  / "]
[" /  / "]
[" /  / "]
[" /  / "]
[" /  / "]
[" /  / "]
[" /  / "]
[" /  / "]
[" /  / "]
[" /  / "]
[" /  / "]
[" /  / "]
[" /  / "]
[" /  / "]
[" /  / "]
[" /  / "]
[" /  / "]
[" /  / "]
[" /  / "]
[" /  / "]
[" /  / "]
[" /  / "]
[" /  / "]
[" /  / "]
[" /  / "]
[" /  / "]
[" /  / "]
[" /  / "]
[" /  / "]
[" /  / "]
[" /  / "]
[" /  / "]
[" /  / "]
[" /  / "]
[" /  / "]
[" /  / "]
[" /  / "]
[" /  / "]
[" /  / "]
[" /  / "]
[" /  / "]
[" /  / "]
[" /  / "]
[" /  / "]
[" /  / "]
[" /  / "]
[" /  / "]
[" /  / "]
[" /  / "]
[{"$f":"D1545&\" / \"&C1545&\" / \"&E1545","v":" /  / "}]
[" /  / "]
[" /  / "]
[" /  / "]
[" /  / "]
[" /  / "]
[" /  / "]
[" /  / "]
[" /  / "]
[" /  / "]
[" /  / "]
[" /  / "]
[" /  / "]
[" /  / "]
[" /  / "]
[" /  / "]
[" /  / "]
[" /  / "]
[" /  / "]
[" /  / "]
[" /  / "]
[" /  / "]
[" /  / "]
[" /  / "]
[" /  / "]
[" /  / "]
[" /  / "]
[" /  / "]
[" /  / "]
[" /  / "]
[" /  / "]
[" /  / "]
[" /  / "]
[" /  / "]
[" /  / "]
[" /  / "]
[" /  / "]
[" /  / "]
[" /  / "]
[" /  / "]
[" /  / "]
[" /  / "]
[" /  / "]
[" /  / "]
[" /  / "]
[" /  / "]
[" /  / "]
[" /  / "]
[" /  / "]
[" /  / "]
[" /  / "]
[" /  / "]
[" /  / "]
[" /  / "]
[" /  / "]
[" /  / "]
[" /  / "]
[" /  / "]
[" /  / "]
[" /  / "]
[" /  / "]
[" /  / "]
[" /  / "]
[" /  / "]
[{"$f":"D1609&\" / \"&C1609&\" / \"&E1609","v":" /  / "}]
[" /  / "]
[" /  / "]
[" /  / "]
[" /  / "]
[" /  / "]
[" /  / "]
[" /  / "]
[" /  / "]
[" /  / "]
[" /  / "]
[" /  / "]
[" /  / "]
[" /  / "]
[" /  / "]
[" /  / "]
[" /  / "]
[" /  / "]
[" /  / "]
[" /  / "]
[" /  / "]
[" /  / "]
[" /  / "]
[" /  / "]
[" /  / "]
[" /  / "]
[" /  / "]
[" /  / "]
[" /  / "]
[" /  / "]
[" /  / "]
[" /  / "]
[" /  / "]
[" /  / "]
[" /  / "]
[" /  / "]
[" /  / "]
[" /  / "]
[" /  / "]
[" /  / "]
[" /  / "]
[" /  / "]
[" /  / "]
[" /  / "]
[" /  / "]
[" /  / "]
[" /  / "]
[" /  / "]
[" /  / "]
[" /  / "]
[" /  / "]
[" /  / "]
[" /  / "]
[" /  / "]
[" /  / "]
[" /  / "]
[" /  / "]
[" /  / "]
[" /  / "]
[" /  / "]
[" /  / "]
[" /  / "]
[" /  / "]
[" /  / "]
[{"$f":"D1673&\" / \"&C1673&\" / \"&E1673","v":" /  / "}]
[" /  / "]
[" /  / "]
[" /  / "]
[" /  / "]
[" /  / "]
[" /  / "]
[" /  / "]
[" /  / "]
[" /  / "]
[" /  / "]
[" /  / "]
[" /  / "]
[" /  / "]
[" /  / "]
[" /  / "]
[" /  / "]
[" /  / "]
[" /  / "]
[" /  / "]
[" /  / "]
[" /  / "]
[" /  / "]
[" /  / "]
[" /  / "]
[" /  / "]
[" /  / "]
[" /  / "]
[" /  / "]
[" /  / "]
[" /  / "]
[" /  / "]
[" /  / "]
[" /  / "]
[" /  / "]
[" /  / "]
[" /  / "]
[" /  / "]
[" /  / "]
[" /  / "]
[" /  / "]
[" /  / "]
[" /  / "]
[" /  / "]
[" /  / "]
[" /  / "]
[" /  / "]
[" /  / "]
[" /  / "]
[" /  / "]
[" /  / "]
[" /  / "]
[" /  / "]
[" /  / "]
[" /  / "]
[" /  / "]
[" /  / "]
[" /  / "]
[" /  / "]
[" /  / "]
[" /  / "]
[" /  / "]
[" /  / "]
[" /  / "]
[{"$f":"D1737&\" / \"&C1737&\" / \"&E1737","v":" /  / "}]
[" /  / "]
[" /  / "]
[" /  / "]
[" /  / "]
[" /  / "]
[" /  / "]
[" /  / "]
[" /  / "]
[" /  / "]
[" /  / "]
[" /  / "]
[" /  / "]
[" /  / "]
[" /  / "]
[" /  / "]
[" /  / "]
[" /  / "]
[" /  / "]
[" /  / "]
[" /  / "]
[" /  / "]
[" /  / "]
[" /  / "]
[" /  / "]
[" /  / "]
[" /  / "]
[" /  / "]
[" /  / "]
[" /  / "]
[" /  / "]
[" /  / "]
[" /  / "]
[" /  / "]
[" /  / "]
[" /  / "]
[" /  / "]
[" /  / "]
[" /  / "]
[" /  / "]
[" /  / "]
[" /  / "]
[" /  / "]
[" /  / "]
[" /  / "]
[" /  / "]
[" /  / "]
[" /  / "]
[" /  / "]
[" /  / "]
[" /  / "]
[" /  / "]
[" /  / "]
[" /  / "]
[" /  / "]
[" /  / "]
[" /  / "]
[" /  / "]
[" /  / "]
[" /  / "]
[" /  / "]
[" /  / "]
[" /  / "]
[" /  / "]
[{"$f":"D1801&\" / \"&C1801&\" / \"&E1801","v":" /  / "}]
[" /  / "]
[" /  / "]
[" /  / "]
[" /  / "]
[" /  / "]
[" /  / "]
[" /  / "]
[" /  / "]
[" /  / "]
[" /  / "]
[" /  / "]
[" /  / "]
[" /  / "]
[" /  / "]
[" /  / "]
[" /  / "]
[" /  / "]
[" /  / "]
[" /  / "]
[" /  / "]
[" /  / "]
[" /  / "]
[" /  / "]
[" /  / "]
[" /  / "]
[" /  / "]
[" /  / "]
[" /  / "]
[" /  / "]
[" /  / "]
[" /  / "]
[" /  / "]
[" /  / "]
[" /  / "]
[" /  / "]
[" /  / "]
[" /  / "]
[" /  / "]
[" /  / "]
[" /  / "]
[" /  / "]
[" /  / "]
[" /  / "]
[" /  / "]
[" /  / "]
[" /  / "]
[" /  / "]
[" /  / "]
[" /  / "]
[" /  / "]
[" /  / "]
[" /  / "]
[" /  / "]
[" /  / "]
[" /  / "]
[" /  / "]
[" /  / "]
[" /  / "]
[" /  / "]
[" /  / "]
[" /  / "]
[" /  / "]
[" /  / "]
[{"$f":"D1865&\" / \"&C1865&\" / \"&E1865","v":" /  / "}]
[" /  / "]
[" /  / "]
[" /  / "]
[" /  / "]
[" /  / "]
[" /  / "]
[" /  / "]
[" /  / "]
[" /  / "]
[" /  / "]
[" /  / "]
[" /  / "]
[" /  / "]
[" /  / "]
[" /  / "]
[" /  / "]
[" /  / "]
[" /  / "]
[" /  / "]
[" /  / "]
[" /  / "]
[" /  / "]
[" /  / "]
[" /  / "]
[" /  / "]
[" /  / "]
[" /  / "]
[" /  / "]
[" /  / "]
[" /  / "]
[" /  / "]
[" /  / "]
[" /  / "]
[" /  / "]
[" /  / "]
[" /  / "]
[" /  / "]
[" /  / "]
[" /  / "]
[" /  / "]
[" /  / "]
[" /  / "]
[" /  / "]
[" /  / "]
[" /  / "]
[" /  / "]
[" /  / "]
[" /  / "]
[" /  / "]
[" /  / "]
[" /  / "]
[" /  / "]
[" /  / "]
[" /  / "]
[" /  / "]
[" /  / "]
[" /  / "]
[" /  / "]
[" /  / "]
[" /  / "]
[" /  / "]
[" /  / "]
[" /  / "]
[{"$f":"D1929&\" / \"&C1929&\" / \"&E1929","v":" /  / "}]
[" /  / "]
[" /  / "]
[" /  / "]
[" /  / "]
[" /  / "]
[" /  / "]
[" /  / "]
[" /  / "]
[" /  / "]
[" /  / "]
[" /  / "]
[" /  / "]
[" /  / "]
[" /  / "]
[" /  / "]
[" /  / "]
[" /  / "]
[" /  / "]
[" /  / "]
[" /  / "]
[" /  / "]
[" /  / "]
[" /  / "]
[" /  / "]
[" /  / "]
[" /  / "]
[" /  / "]
[" /  / "]
[" /  / "]
[" /  / "]
[" /  / "]
[" /  / "]
[" /  / "]
[" /  / "]
[" /  / "]
[" /  / "]
[" /  / "]
[" /  / "]
[" /  / "]
[" /  / "]
[" /  / "]
[" /  / "]
[" /  / "]
[" /  / "]
[" /  / "]
[" /  / "]
[" /  / "]
[" /  / "]
[" /  / "]
[" /  / "]
[" /  / "]
[" /  / "]
[" /  / "]
[" /  / "]
[" /  / "]
[" /  / "]
[" /  / "]
[" /  / "]
[" /  / "]
[" /  / "]
[" /  / "]
[" /  / "]
[" /  / "]
[{"$f":"D1993&\" / \"&C1993&\" / \"&E1993","v":" /  / "}]
[" /  / "]
[" /  / "]
[" /  / "]
[" /  / "]
[" /  / "]
[" /  / "]
[" /  / "]
[" /  / "]
[" /  / "]
[" /  / "]
[" /  / "]
[" /  / "]
[" /  / "]
[" /  / "]
[" /  / "]
[" /  / "]
[" /  / "]
[" /  / "]
[" /  / "]
[" /  / "]
[" /  / "]
[" /  / "]
[" /  / "]
[" /  / "]
[" /  / "]
[" /  / "]
[" /  / "]
[" /  / "]
[" /  / "]
[" /  / "]
[" /  / "]
[" /  / "]
[" /  / "]
[" /  / "]
[" /  / "]
[" /  / "]
[" /  / "]
[" /  / "]
[" /  / "]
[" /  / "]
[" /  / "]
[" /  / "]
[" /  / "]
[" /  / "]
[" /  / "]
[" /  / "]
[" /  / "]
[" /  / "]
[" /  / "]
[" /  / "]
[" /  / "]
[" /  / "]
[" /  / "]
[" /  / "]
[" /  / "]
[" /  / "]
[" /  / "]
[" /  / "]
[" /  / "]
[" /  / "]
[" /  / "]
[" /  / "]
[" /  / "]
[{"$f":"D2057&\" / \"&C2057&\" / \"&E2057","v":" /  / "}]
[" /  / "]
[" /  / "]
[" /  / "]
[" /  / "]
[" /  / "]
[" /  / "]
[" /  / "]
[" /  / "]
[" /  / "]
[" /  / "]
[" /  / "]
[" /  / "]
[" /  / "]
[" /  / "]
[" /  / "]
[" /  / "]
[" /  / "]
[" /  / "]
[" /  / "]
[" /  / "]
[" /  / "]
[" /  / "]
[" /  / "]
[" /  / "]
[" /  / "]
[" /  / "]
[" /  / "]
[" /  / "]
[" /  / "]
[" /  / "]
[" /  / "]
[" /  / "]
[" /  / "]
[" /  / "]
[" /  / "]
[" /  / "]
[" /  / "]
[" /  / "]
[" /  / "]
[" /  / "]
[" /  / "]
[" /  / "]
[" /  / "]
[" /  / "]
[" /  / "]
[" /  / "]
[" /  / "]
[" /  / "]
[" /  / "]
[" /  / "]
[" /  / "]
[" /  / "]
[" /  / "]
[" /  / "]
[" /  / "]
[" /  / "]
[" /  / "]
[" /  / "]
[" /  / "]
[" /  / "]
[" /  / "]
[" /  / "]
[" /  / "]
[{"$f":"D2121&\" / \"&C2121&\" / \"&E2121","v":" /  / "}]
[" /  / "]
[" /  / "]
[" /  / "]
[" /  / "]
[" /  / "]
[" /  / "]
[" /  / "]
[" /  / "]
[" /  / "]
[" /  / "]
[" /  / "]
[" /  / "]
[" /  / "]
[" /  / "]
[" /  / "]
[" /  / "]
[" /  / "]
[" /  / "]
[" /  / "]
[" /  / "]
[" /  / "]
[" /  / "]
[" /  / "]
[" /  / "]
[" /  / "]
[" /  / "]
[" /  / "]
[" /  / "]
[" /  / "]
[" /  / "]
[" /  / "]
[" /  / "]
[" /  / "]
[" /  / "]
[" /  / "]
[" /  / "]
[" /  / "]
[" /  / "]
[" /  / "]
[" /  / "]
[" /  / "]
[" /  / "]
[" /  / "]
[" /  / "]
[" /  / "]
[" /  / "]
[" /  / "]
[" /  / "]
[" /  / "]
[" /  / "]
[" /  / "]
[" /  / "]
[" /  / "]
[" /  / "]
[" /  / "]
[" /  / "]
[" /  / "]
[" /  / "]
[" /  / "]
[" /  / "]
[" /  / "]
[" /  / "]
[" /  / "]
[{"$f":"D2185&\" / \"&C2185&\" / \"&E2185","v":" /  / "}]
[" /  / "]
[" /  / "]
[" /  / "]
[" /  / "]
[" /  / "]
[" /  / "]
[" /  / "]
[" /  / "]
[" /  / "]
[" /  / "]
[" /  / "]
[" /  / "]
[" /  / "]
[" /  / "]
[" /  / "]
[" /  / "]
[" /  / "]
[" /  / "]
[" /  / "]
[" /  / "]
[" /  / "]
[" /  / "]
[" /  / "]
[" /  / "]
[" /  / "]
[" /  / "]
[" /  / "]
[" /  / "]
[" /  / "]
[" /  / "]
[" /  / "]
[" /  / "]
[" /  / "]
[" /  / "]
[" /  / "]
[" /  / "]
[" /  / "]
[" /  / "]
[" /  / "]
[" /  / "]
[" /  / "]
[" /  / "]
[" /  / "]
[" /  / "]
[" /  / "]
[" /  / "]
[" /  / "]
[" /  / "]
[" /  / "]
[" /  / "]
[" /  / "]
[" /  / "]
[" /  / "]
[" /  / "]
[" /  / "]
[" /  / "]
[" /  / "]
[" /  / "]
[" /  / "]
[" /  / "]
[" /  / "]
[" /  / "]
[" /  / "]
[{"$f":"D2249&\" / \"&C2249&\" / \"&E2249","v":" /  / "}]
[" /  / "]
[" /  / "]
[" /  / "]
[" /  / "]
[" /  / "]
[" /  / "]
[" /  / "]
[" /  / "]
[" /  / "]
[" /  / "]
[" /  / "]
[" /  / "]
[" /  / "]
[" /  / "]
[" /  / "]
[" /  / "]
[" /  / "]
[" /  / "]
[" /  / "]
[" /  / "]
[" /  / "]
[" /  / "]
[" /  / "]
[" /  / "]
[" /  / "]
[" /  / "]
[" /  / "]
[" /  / "]
[" /  / "]
[" /  / "]
[" /  / "]
[" /  / "]
[" /  / "]
[" /  / "]
[" /  / "]
[" /  / "]
[" /  / "]
[" /  / "]
[" /  / "]
[" /  / "]
[" /  / "]
[" /  / "]
[" /  / "]
[" /  / "]
[" /  / "]
[" /  / "]
[" /  / "]
[" /  / "]
[" /  / "]
[" /  / "]
[" /  / "]
[" /  / "]
[" /  / "]
[" /  / "]
[" /  / "]
[" /  / "]
[" /  / "]
[" /  / "]
[" /  / "]
[" /  / "]
[" /  / "]
[" /  / "]
[" /  / "]
[{"$f":"D2313&\" / \"&C2313&\" / \"&E2313","v":" /  / "}]
[" /  / "]
[" /  / "]
[" /  / "]
[" /  / "]
[" /  / "]
[" /  / "]
[" /  / "]
[" /  / "]
[" /  / "]
[" /  / "]
[" /  / "]
[" /  / "]
[" /  / "]
[" /  / "]
[" /  / "]
[" /  / "]
[" /  / "]
[" /  / "]
[" /  / "]
[" /  / "]
[" /  / "]
[" /  / "]
[" /  / "]
[" /  / "]
[" /  / "]
[" /  / "]
[" /  / "]
[" /  / "]
[" /  / "]
[" /  / "]
[" /  / "]
[" /  / "]
[" /  / "]
[" /  / "]
[" /  / "]
[" /  / "]
[" /  / "]
[" /  / "]
[" /  / "]
[" /  / "]
[" /  / "]
[" /  / "]
[" /  / "]
[" /  / "]
[" /  / "]
[" /  / "]
[" /  / "]
[" /  / "]
[" /  / "]
[" /  / "]
[" /  / "]
[" /  / "]
[" /  / "]
[" /  / "]
[" /  / "]
[" /  / "]
[" /  / "]
[" /  / "]
[" /  / "]
[" /  / "]
[" /  / "]
[" /  / "]
[" /  / "]
[{"$f":"D2377&\" / \"&C2377&\" / \"&E2377","v":" /  / "}]
[" /  / "]
[" /  / "]
[" /  / "]
[" /  / "]
[" /  / "]
[" /  / "]
[" /  / "]
[" /  / "]
[" /  / "]
[" /  / "]
[" /  / "]
[" /  / "]
[" /  / "]
[" /  / "]
[" /  / "]
[" /  / "]
[" /  / "]
[" /  / "]
[" /  / "]
[" /  / "]
[" /  / "]
[" /  / "]
[" /  / "]
[" /  / "]
[" /  / "]
[" /  / "]
[" /  / "]
[" /  / "]
[" /  / "]
[" /  / "]
[" /  / "]
[" /  / "]
[" /  / "]
[" /  / "]
[" /  / "]
[" /  / "]
[" /  / "]
[" /  / "]
[" /  / "]
[" /  / "]
[" /  / "]
[" /  / "]
[" /  / "]
[" /  / "]
[" /  / "]
[" /  / "]
[" /  / "]
[" /  / "]
[" /  / "]
[" /  / "]
[" /  / "]
[" /  / "]
[" /  / "]
[" /  / "]
[" /  / "]
[" /  / "]
[" /  / "]
[" /  / "]
[" /  / "]
[" /  / "]
[" /  / "]
[" /  / "]
[" /  / "]
[{"$f":"D2441&\" / \"&C2441&\" / \"&E2441","v":" /  / "}]
[" /  / "]
[" /  / "]
[" /  / "]
[" /  / "]
[" /  / "]
[" /  / "]
[" /  / "]
[" /  / "]
[" /  / "]
[" /  / "]
[" /  / "]
[" /  / "]
[" /  / "]
[" /  / "]
[" /  / "]
[" /  / "]
[" /  / "]
[" /  / "]
[" /  / "]
[" /  / "]
[" /  / "]
[" /  / "]
[" /  / "]
[" /  / "]
[" /  / "]
[" /  / "]
[" /  / "]
[" /  / "]
[" /  / "]
[" /  / "]
[" /  / "]
[" /  / "]
[" /  / "]
[" /  / "]
[" /  / "]
[" /  / "]
[" /  / "]
[" /  / "]
[" /  / "]
[" /  / "]
[" /  / "]
[" /  / "]
[" /  / "]
[" /  / "]
[" /  / "]
[" /  / "]
[" /  / "]
[" /  / "]
[" /  / "]
[" /  / "]
[" /  / "]
[" /  / "]
[" /  / "]
[" /  / "]
[" /  / "]
[" /  / "]
[" /  / "]
[" /  / "]
[" /  / "]
[" /  / "]
[" /  / "]
[" /  / "]
[" /  / "]
[{"$f":"D2505&\" / \"&C2505&\" / \"&E2505","v":" /  / "}]
[" /  / "]
[" /  / "]
[" /  / "]
[" /  / "]
[" /  / "]
[" /  / "]
[" /  / "]
[" /  / "]
[" /  / "]
[" /  / "]
[" /  / "]
[" /  / "]
[" /  / "]
[" /  / "]
[" /  / "]
[" /  / "]
[" /  / "]
[" /  / "]
[" /  / "]
[" /  / "]
[" /  / "]
[" /  / "]
[" /  / "]
[" /  / "]
[" /  / "]
[" /  / "]
[" /  / "]
[" /  / "]
[" /  / "]
[" /  / "]
[" /  / "]
[" /  / "]
[" /  / "]
[" /  / "]
[" /  / "]
[" /  / "]
[" /  / "]
[" /  / "]
[" /  / "]
[" /  / "]
[" /  / "]
[" /  / "]
[" /  / "]
[" /  / "]
[" /  / "]
[" /  / "]
[" /  / "]
[" /  / "]
[" /  / "]
[" /  / "]
[" /  / "]
[" /  / "]
[" /  / "]
[" /  / "]
[" /  / "]
[" /  / "]
[" /  / "]
[" /  / "]
[" /  / "]
[" /  / "]
[" /  / "]
[" /  / "]
[" /  / "]
[{"$f":"D2569&\" / \"&C2569&\" / \"&E2569","v":" /  / "}]
[" /  / "]
[" /  / "]
[" /  / "]
[" /  / "]
[" /  / "]
[" /  / "]
[" /  / "]
[" /  / "]
[" /  / "]
[" /  / "]
[" /  / "]
[" /  / "]
[" /  / "]
[" /  / "]
[" /  / "]
[" /  / "]
[" /  / "]
[" /  / "]
[" /  / "]
[" /  / "]
[" /  / "]
[" /  / "]
[" /  / "]
[" /  / "]
[" /  / "]
[" /  / "]
[" /  / "]
[" /  / "]
[" /  / "]
[" /  / "]
[" /  / "]
[" /  / "]
[" /  / "]
[" /  / "]
[" /  / "]
[" /  / "]
[" /  / "]
[" /  / "]
[" /  / "]
[" /  / "]
[" /  / "]
[" /  / "]
[" /  / "]
[" /  / "]
[" /  / "]
[" /  / "]
[" /  / "]
[" /  / "]
[" /  / "]
[" /  / "]
[" /  / "]
[" /  / "]
[" /  / "]
[" /  / "]
[" /  / "]
[" /  / "]
[" /  / "]
[" /  / "]
[" /  / "]
[" /  / "]
[" /  / "]
[" /  / "]
[" /  / "]
[{"$f":"D2633&\" / \"&C2633&\" / \"&E2633","v":" /  / "}]
[" /  / "]
[" /  / "]
[" /  / "]
[" /  / "]
[" /  / "]
[" /  / "]
[" /  / "]
[" /  / "]
[" /  / "]
[" /  / "]
[" /  / "]
[" /  / "]
[" /  / "]
[" /  / "]
[" /  / "]
[" /  / "]
[" /  / "]
[" /  / "]
[" /  / "]
[" /  / "]
[" /  / "]
[" /  / "]
[" /  / "]
[" /  / "]
[" /  / "]
[" /  / "]
[" /  / "]
[" /  / "]
[" /  / "]
[" /  / "]
[" /  / "]
[" /  / "]
[" /  / "]
[" /  / "]
[" /  / "]
[" /  / "]
[" /  / "]
[" /  / "]
[" /  / "]
[" /  / "]
[" /  / "]
[" /  / "]
[" /  / "]
[" /  / "]
[" /  / "]
[" /  / "]
[" /  / "]
[" /  / "]
[" /  / "]
[" /  / "]
[" /  / "]
[" /  / "]
[" /  / "]
[" /  / "]
[" /  / "]
[" /  / "]
[" /  / "]
[" /  / "]
[" /  / "]
[" /  / "]
[" /  / "]
[" /  / "]
[" /  / "]
[{"$f":"D2697&\" / \"&C2697&\" / \"&E2697","v":" /  / "}]
[" /  / "]
[" /  / "]
[" /  / "]
[" /  / "]
[" /  / "]
[" /  / "]
[" /  / "]
[" /  / "]
[" /  / "]
[" /  / "]
[" /  / "]
[" /  / "]
[" /  / "]
[" /  / "]
[" /  / "]
[" /  / "]
[" /  / "]
[" /  / "]
[" /  / "]
[" /  / "]
[" /  / "]
[" /  / "]
[" /  / "]
[" /  / "]
[" /  / "]
[" /  / "]
[" /  / "]
[" /  / "]
[" /  / "]
[" /  / "]
[" /  / "]
[" /  / "]
[" /  / "]
[" /  / "]
[" /  / "]
[" /  / "]
[" /  / "]
[" /  / "]
[" /  / "]
[" /  / "]
[" /  / "]
[" /  / "]
[" /  / "]
[" /  / "]
[" /  / "]
[" /  / "]
[" /  / "]
[" /  / "]
[" /  / "]
[" /  / "]
[" /  / "]
[" /  / "]
[" /  / "]
[" /  / "]
[" /  / "]
[" /  / "]
[" /  / "]
[" /  / "]
[" /  / "]
[" /  / "]
[" /  / "]
[" /  / "]
[" /  / "]
[{"$f":"D2761&\" / \"&C2761&\" / \"&E2761","v":" /  / "}]
[" /  / "]
[" /  / "]
[" /  / "]
[" /  / "]
[" /  / "]
[" /  / "]
[" /  / "]
[" /  / "]
[" /  / "]
[" /  / "]
[" /  / "]
[" /  / "]
[" /  / "]
[" /  / "]
[" /  / "]
[" /  / "]
[" /  / "]
[" /  / "]
[" /  / "]
[" /  / "]
[" /  / "]
[" /  / "]
[" /  / "]
[" /  / "]
[" /  / "]
[" /  / "]
[" /  / "]
[" /  / "]
[" /  / "]
[" /  / "]
[" /  / "]
[" /  / "]
[" /  / "]
[" /  / "]
[" /  / "]
[" /  / "]
[" /  / "]
[" /  / "]
[" /  / "]
[" /  / "]
[" /  / "]
[" /  / "]
[" /  / "]
[" /  / "]
[" /  / "]
[" /  / "]
[" /  / "]
[" /  / "]
[" /  / "]
[" /  / "]
[" /  / "]
[" /  / "]
[" /  / "]
[" /  / "]
[" /  / "]
[" /  / "]
[" /  / "]
[" /  / "]
[" /  / "]
[" /  / "]
[" /  / "]
[" /  / "]
[" /  / "]
[{"$f":"D2825&\" / \"&C2825&\" / \"&E2825","v":" /  / "}]
[" /  / "]
[" /  / "]
[" /  / "]
[" /  / "]
[" /  / "]
[" /  / "]
[" /  / "]
[" /  / "]
[" /  / "]
[" /  / "]
[" /  / "]
[" /  / "]
[" /  / "]
[" /  / "]
[" /  / "]
[" /  / "]
[" /  / "]
[" /  / "]
[" /  / "]
[" /  / "]
[" /  / "]
[" /  / "]
[" /  / "]
[" /  / "]
[" /  / "]
[" /  / "]
[" /  / "]
[" /  / "]
[" /  / "]
[" /  / "]
[" /  / "]
[" /  / "]
[" /  / "]
[" /  / "]
[" /  / "]
[" /  / "]
[" /  / "]
[" /  / "]
[" /  / "]
[" /  / "]
[" /  / "]
[" /  / "]
[" /  / "]
[" /  / "]
[" /  / "]
[" /  / "]
[" /  / "]
[" /  / "]
[" /  / "]
[" /  / "]
[" /  / "]
[" /  / "]
[" /  / "]
[" /  / "]
[" /  / "]
[" /  / "]
[" /  / "]
[" /  / "]
[" /  / "]
[" /  / "]
[" /  / "]
[" /  / "]
[" /  / "]
[{"$f":"D2889&\" / \"&C2889&\" / \"&E2889","v":" /  / "}]
[" /  / "]
[" /  / "]
[" /  / "]
[" /  / "]
[" /  / "]
[" /  / "]
[" /  / "]
[" /  / "]
[" /  / "]
[" /  / "]
[" /  / "]
[" /  / "]
[" /  / "]
[" /  / "]
[" /  / "]
[" /  / "]
[" /  / "]
[" /  / "]
[" /  / "]
[" /  / "]
[" /  / "]
[" /  / "]
[" /  / "]
[" /  / "]
[" /  / "]
[" /  / "]
[" /  / "]
[" /  / "]
[" /  / "]
[" /  / "]
[" /  / "]
[" /  / "]
[" /  / "]
[" /  / "]
[" /  / "]
[" /  / "]
[" /  / "]
[" /  / "]
[" /  / "]
[" /  / "]
[" /  / "]
[" /  / "]
[" /  / "]
[" /  / "]
[" /  / "]
[" /  / "]
[" /  / "]
[" /  / "]
[" /  / "]
[" /  / "]
[" /  / "]
[" /  / "]
[" /  / "]
[" /  / "]
[" /  / "]
[" /  / "]
[" /  / "]
[" /  / "]
[" /  / "]
[" /  / "]
[" /  / "]
[" /  / "]
[" /  / "]
[{"$f":"D2953&\" / \"&C2953&\" / \"&E2953","v":" /  / "}]
[" /  / "]
[" /  / "]
[" /  / "]
[" /  / "]
[" /  / "]
[" /  / "]
[" /  / "]
[" /  / "]
[" /  / "]
[" /  / "]
[" /  / "]
[" /  / "]
[" /  / "]
[" /  / "]
[" /  / "]
[" /  / "]
[" /  / "]
[" /  / "]
[" /  / "]
[" /  / "]
[" /  / "]
[" /  / "]
[" /  / "]
[" /  / "]
[" /  / "]
[" /  / "]
[" /  / "]
[" /  / "]
[" /  / "]
[" /  / "]
[" /  / "]
[" /  / "]
[" /  / "]
[" /  / "]
[" /  / "]
[" /  / "]
[" /  / "]
[" /  / "]
[" /  / "]
[" /  / "]
[" /  / "]
[" /  / "]
[" /  / "]
[" /  / "]
[" /  / "]
[" /  / "]
[" /  / "]
[" /  / "]
[" /  / "]
[" /  / "]
[" /  / "]
[" /  / "]
[" /  / "]
[" /  / "]
[" /  / "]
[" /  / "]
[" /  / "]
[" /  / "]
[" /  / "]
[" /  / "]
[" /  / "]
[" /  / "]
[" /  / "]
[{"$f":"D3017&\" / \"&C3017&\" / \"&E3017","v":" /  / "}]
[" /  / "]
[" /  / "]
[" /  / "]
[" /  / "]
[" /  / "]

{"sheet":"Indizes 2024 Schätzung 2025","index":9,"n_rows":20,"n_cols":27,"rows_kept":20,"cut":false,"hidden":true,"merged":[[14,24,14,25],[15,24,15,25],[16,24,16,25],[17,24,17,25],[7,22,7,23],[8,22,8,23],[10,24,10,25],[11,24,11,25],[12,24,12,25],[13,24,13,25]]}
["Quelle: Oberer Gutachterausschuss für Grundstückswerte Rheinland-Pfalz gem. Landesgrundstückmarkbericht 2025"]
[{"$f":"EingabeMaske!E1","v":"WE-Rechner, Version 2 - LGMB 2025, Stand 11.2025"}]
[]
[]
[]
[]
[]
[null,"Indizes jeweils zum 1.1. des Jahres, für Rechner des LfSt inkl. Schätzung 1.1.2025",null,null,null,null,null,null,null,null,null,null,null,null,null,null,null,null,null,null,null,"Marktsegment","Stichtag",null,{"$f":"DATE(W10,1,1)","v":"2024-01-01"},{"$f":"DATE(X10,1,1)","v":"2025-01-01"},"Stichtag Richtwert"]
[null,"Preisindex für Wohnungseigentume (Weiterverkäufe)",null,null,null,null,null,null,null,null,null,null,null,null,null,null,"Stichtag Richtwert","Schätzung OGA","LfST",null,null,{"$f":"EingabeMaske!D32","v":0},{"$f":"EingabeMaske!D15","v":"2024-01-02"},null,"Tage","Tage","2024-01-01"]
[null,"Markt-segment",2010,2011,2012,2013,2014,2015,2016,2017,2018,2019,2020,2021,2022,2023,2024,2025,2026,null,null,null,{"$f":"YEAR(W9)","v":2024},{"$f":"W10+1","v":2025},{"$f":"_xlfn.DAYS(W9,Y8)","v":1},{"$f":"_xlfn.DAYS(Z8,Y8)","v":366},{"$f":"YEAR(AA9)","v":2024}]
[null,1,100,85.793650793650798,88.862433862433861,92.116402116402114,98.253968253968253,97.394179894179914,101.94444444444446,113.16137566137567,118.25396825396825,126.7989417989418,138.49206349206352,158.94179894179896,186,167,186,{"$f":"Q11","v":186},{"$f":"R11","v":186},null,null,1,{"$f":"ROUND(HLOOKUP(W$10,$C$10:$S$17,2),1)","v":186},{"$f":"ROUND(HLOOKUP(X$10,$C$10:$S$17,2),1)","v":186},{"$f":"W11+(X11-W11)*$Y$10/$Z$10","v":186},null,{"$f":"HLOOKUP($AA$10,$E$10:$Q$17,2)","v":186}]
[null,2,100,99.247121346324192,98.051372896368477,99.247121346324192,98.815323294951284,102.43578387953943,105.82373782108061,111.61426040744023,119.2648361381754,127.59078830823741,139.88042515500442,157,181,194,192,{"$f":"Q12","v":192},192,null,null,2,{"$f":"ROUND(HLOOKUP(W$10,$C$10:$S$17,3),1)","v":192},{"$f":"ROUND(HLOOKUP(X$10,$C$10:$S$17,3),1)","v":192},{"$f":"W12+(X12-W12)*$Y$10/$Z$10","v":192},null,{"$f":"HLOOKUP($AA$10,$E$10:$Q$17,3)","v":192}]
[null,3,100,99.641475610906667,105.71752052080383,108.20832153976789,112.01056703462591,114.97311067081802,123.12482309651853,131.40862345504294,142.126615718464,150.69346164732519,167.27049721671852,188,230,233,230,230,230,null,null,3,{"$f":"ROUND(HLOOKUP(W$10,$C$10:$S$17,4),1)","v":230},{"$f":"ROUND(HLOOKUP(X$10,$C$10:$S$17,4),1)","v":230},230,null,{"$f":"HLOOKUP($AA$10,$E$10:$Q$17,4)","v":230}]
[null,4,100,102.35121234386482,105.81373989713447,110.92946362968405,116.10947832476121,123.58559882439384,131.26377663482737,143.99338721528289,157.21895664952243,174.4489346069067,193.8280675973549,223,263,256,231,231,231,null,null,4,{"$f":"ROUND(HLOOKUP(W$10,$C$10:$S$17,5),1)","v":231},{"$f":"ROUND(HLOOKUP(X$10,$C$10:$S$17,5),1)","v":231},{"$f":"W14+(X14-W14)*$Y$10/$Z$10","v":231},null,{"$f":"HLOOKUP($AA$10,$E$10:$Q$17,5)","v":231}]
[null,5,100,103.47150259067357,109.64470762398224,115.92894152479644,124.30792005921541,132.08734270910435,142.68689859363434,153.84900074019242,166.49888971132492,183.51591413767579,203.10880829015539,227,253,248,227,227,227,null,null,5,{"$f":"ROUND(HLOOKUP(W$10,$C$10:$S$17,6),1)","v":227},{"$f":"ROUND(HLOOKUP(X$10,$C$10:$S$17,6),1)","v":227},227,null,{"$f":"HLOOKUP($AA$10,$E$10:$Q$17,6)","v":227}]
[null,6,100,103.10262529832937,108.34659241580482,117.83346592415805,126.98886237072395,138.37178467250067,151.63086714399364,167.73402280562186,182.98196764783879,199.87403871652086,218.40360647043221,245.37258021744896,276,263,248,248,248,null,null,6,{"$f":"ROUND(HLOOKUP(W$10,$C$10:$S$17,7),1)","v":248},{"$f":"ROUND(HLOOKUP(X$10,$C$10:$S$17,7),1)","v":248},{"$f":"W16+(X16-W16)*$Y$10/$Z$10","v":248},null,{"$f":"HLOOKUP($AA$10,$E$10:$Q$17,7)","v":248}]
[null,"Ø RLP",100,101.75438596491229,105.47049441786282,110.39872408293461,115.99681020733652,122.39234449760765,131.81818181818181,143.62041467304624,156.64274322169061,171.90590111642746,189.76874003189795,213,240,237,214,214,214,null,null,"Ø RLP",{"$f":"ROUND(HLOOKUP(W$10,$C$10:$S$17,8),1)","v":214},{"$f":"ROUND(HLOOKUP(X$10,$C$10:$S$17,8),1)","v":214},214,null,{"$f":"HLOOKUP($AA$10,$E$10:$Q$17,8)","v":214}]
[null,null,null,null,null,null,null,null,null,null,null,null,null,null,null,null,null,null,null,null,null,{"$f":"V9","v":0},null,"=",{"$f":"ROUND(VLOOKUP(V9,V11:Y17,4),1)","v":{"$error":"#N/A"}},null,{"$f":"ROUND(VLOOKUP(V9,V11:AA17,6),1)","v":{"$error":"#N/A"}}]
[null,"© Oberer Gutachterausschuss für Grundstückswerte Rheinland-Pfalz, Stand Juli 2024"]
[null,"vgl. LGMB 2025, Abschnitt 4.6.2 "]

{"sheet":"Indizes 2025 Schätzung 2026","index":10,"n_rows":20,"n_cols":27,"rows_kept":20,"cut":false,"hidden":true,"merged":[[14,24,14,25],[15,24,15,25],[16,24,16,25],[17,24,17,25],[7,22,7,23],[8,22,8,23],[10,24,10,25],[11,24,11,25],[12,24,12,25],[13,24,13,25]]}
["Quelle: Oberer Gutachterausschuss für Grundstückswerte Rheinland-Pfalz gem. Landesgrundstückmarkbericht 2025"]
[{"$f":"EingabeMaske!E1","v":"WE-Rechner, Version 2 - LGMB 2025, Stand 11.2025"}]
[]
[]
[]
[]
[]
[null,"Indizes jeweils zum 1.1. des Jahres, für Rechner des LfSt inkl. Schätzung 1.1.2026",null,null,null,null,null,null,null,null,null,null,null,null,null,null,null,null,null,null,null,"Marktsegment","Stichtag",null,{"$f":"DATE(W10,1,1)","v":"2024-01-01"},{"$f":"DATE(X10,1,1)","v":"2025-01-01"},"Stichtag Richtwert"]
[null,"Preisindex für Wohnungseigentume (Weiterverkäufe)",null,null,null,null,null,null,null,null,null,null,null,null,null,null,"Stichtag Richtwert","neu","Schätzung OGA","LfST",null,{"$f":"EingabeMaske!D32","v":0},{"$f":"EingabeMaske!D15","v":"2024-01-02"},null,"Tage","Tage","2024-01-01"]
[null,"Markt-segment",2010,2011,2012,2013,2014,2015,2016,2017,2018,2019,2020,2021,2022,2023,2024,2025,2026,2027,null,null,{"$f":"YEAR(W9)","v":2024},{"$f":"W10+1","v":2025},{"$f":"_xlfn.DAYS(W9,Y8)","v":1},{"$f":"_xlfn.DAYS(Z8,Y8)","v":366},{"$f":"YEAR(AA9)","v":2024}]
[null,1,100,85.793650793650798,88.862433862433861,92.116402116402114,98.253968253968253,97.394179894179914,101.94444444444446,113.16137566137567,118.25396825396825,126.7989417989418,138.49206349206352,158.94179894179896,186,167,185,178,{"$f":"R11","v":178},{"$f":"S11","v":178},null,1,{"$f":"ROUND(HLOOKUP(W$10,$C$10:$T$17,2),1)","v":185},{"$f":"ROUND(HLOOKUP(X$10,$C$10:$T$17,2),1)","v":178},{"$f":"W11+(X11-W11)*$Y$10/$Z$10","v":184.98087431693989},null,{"$f":"HLOOKUP($AA$10,$E$10:$Q$17,2)","v":185}]
[null,2,100,99.247121346324192,98.051372896368477,99.247121346324192,98.815323294951284,102.43578387953943,105.82373782108061,111.61426040744023,119.2648361381754,127.59078830823741,139.88042515500442,157,181,194,184,214,{"$f":"R12","v":214},214,null,2,{"$f":"ROUND(HLOOKUP(W$10,$C$10:$T$17,3),1)","v":184},{"$f":"ROUND(HLOOKUP(X$10,$C$10:$T$17,3),1)","v":214},{"$f":"W12+(X12-W12)*$Y$10/$Z$10","v":184.08196721311475},null,{"$f":"HLOOKUP($AA$10,$E$10:$Q$17,3)","v":184}]
[null,3,100,99.641475610906667,105.71752052080383,108.20832153976789,112.01056703462591,114.97311067081802,123.12482309651853,131.40862345504294,142.126615718464,150.69346164732519,167.27049721671852,188,230,233,231,228,228,228,null,3,{"$f":"ROUND(HLOOKUP(W$10,$C$10:$T$17,4),1)","v":231},{"$f":"ROUND(HLOOKUP(X$10,$C$10:$T$17,4),1)","v":228},230.99180327868854,null,{"$f":"HLOOKUP($AA$10,$E$10:$Q$17,4)","v":231}]
[null,4,100,102.35121234386482,105.81373989713447,110.92946362968405,116.10947832476121,123.58559882439384,131.26377663482737,143.99338721528289,157.21895664952243,174.4489346069067,193.8280675973549,223,263,256,233,246,246,246,null,4,{"$f":"ROUND(HLOOKUP(W$10,$C$10:$T$17,5),1)","v":233},{"$f":"ROUND(HLOOKUP(X$10,$C$10:$T$17,5),1)","v":246},{"$f":"W14+(X14-W14)*$Y$10/$Z$10","v":233.03551912568307},null,{"$f":"HLOOKUP($AA$10,$E$10:$Q$17,5)","v":233}]
[null,5,100,103.47150259067357,109.64470762398224,115.92894152479644,124.30792005921541,132.08734270910435,142.68689859363434,153.84900074019242,166.49888971132492,183.51591413767579,203.10880829015539,227,253,248,227,231,231,231,null,5,{"$f":"ROUND(HLOOKUP(W$10,$C$10:$T$17,6),1)","v":227},{"$f":"ROUND(HLOOKUP(X$10,$C$10:$T$17,6),1)","v":231},227.01092896174865,null,{"$f":"HLOOKUP($AA$10,$E$10:$Q$17,6)","v":227}]
[null,6,100,103.10262529832937,108.34659241580482,117.83346592415805,126.98886237072395,138.37178467250067,151.63086714399364,167.73402280562186,182.98196764783879,199.87403871652086,218.40360647043221,245.37258021744896,276,263,250,248,248,248,null,6,{"$f":"ROUND(HLOOKUP(W$10,$C$10:$T$17,7),1)","v":250},{"$f":"ROUND(HLOOKUP(X$10,$C$10:$T$17,7),1)","v":248},{"$f":"W16+(X16-W16)*$Y$10/$Z$10","v":249.99453551912569},null,{"$f":"HLOOKUP($AA$10,$E$10:$Q$17,7)","v":250}]
[null,"Ø RLP",100,101.75438596491229,105.47049441786282,110.39872408293461,115.99681020733652,122.39234449760765,131.81818181818181,143.62041467304624,156.64274322169061,171.90590111642746,189.76874003189795,213,240,237,222,230,230,230,null,"Ø RLP",{"$f":"ROUND(HLOOKUP(W$10,$C$10:$T$17,8),1)","v":222},{"$f":"ROUND(HLOOKUP(X$10,$C$10:$T$17,8),1)","v":230},222.02185792349727,null,{"$f":"HLOOKUP($AA$10,$E$10:$Q$17,8)","v":222}]
[null,null,null,null,null,null,null,null,null,null,null,null,null,null,null,null,null,null,null,null,null,{"$f":"V9","v":0},null,"=",{"$f":"ROUND(VLOOKUP(V9,V11:Y17,4),1)","v":{"$error":"#N/A"}},null,{"$f":"ROUND(VLOOKUP(V9,V11:AA17,6),1)","v":{"$error":"#N/A"}}]
[null,"© Oberer Gutachterausschuss für Grundstückswerte Rheinland-Pfalz, Stand Juli 2025"]
[null,"vgl. LGMB 2023, Abschnitt 4.6.1 und 4.6.2 "]

{"sheet":"RND ImmoWertV","index":11,"n_rows":15,"n_cols":31,"rows_kept":15,"cut":false,"hidden":true,"merged":[]}
[]
["Restnutzungsdauer bei Modernisierung nach ImmoWertV"]
[null,null,null,null,null,null,null,null,null,"a",1.25,1.25,1.0767,0.90329999999999999,0.73,0.67249999999999999,0.61499999999999999,0.5575,0.5,0.46600000000000003,0.432,0.39800000000000002,0.36399999999999999,0.33,0.30399999999999999,0.27800000000000002,0.252,0.22600000000000001,0.2,0.2,0.2]
[null,null,null,null,null,null,null,null,null,"b",2.625,2.625,2.2757000000000001,1.9262999999999999,1.577,1.4578,1.3385,1.2193000000000001,1.1000000000000001,1.0269999999999999,0.95399999999999996,0.88100000000000001,0.80800000000000005,0.73499999999999999,0.67600000000000005,0.61699999999999999,0.55800000000000005,0.499,0.44,0.44,0.44]
[null,null,null,null,null,null,null,null,null,"c",1.5249999999999999,1.5249999999999999,1.3877999999999999,1.2504999999999999,1.1133,1.085,1.0567,1.0283,1,0.99060000000000004,0.98109999999999997,0.97170000000000001,0.96220000000000006,0.95279999999999998,0.9506,0.94850000000000001,0.94630000000000003,0.94420000000000004,0.94199999999999995,0.94199999999999995,0.94199999999999995]
[null,null,null,null,null,null,null,null,null,"ab rel. Alter",60,60,55,55,40,35,30,25,20,19,18,17,16,15,14,13,12,11,10,10,10]
[]
[null,"Ergebnis",null,null,null,null,null,"Vorgaben"]
[null,"RND","Pkte","abger. Pkte","RND","aufger. Pkte","RND","GND","Alter","rel. Alter [%]",0,{"$f":"K9+1","v":1},{"$f":"L9+1","v":2},3,4,5,6,7,8,9,10,11,12,13,14,15,16,17,18,19,20]
[1,{"$f":"ROUND(E10+(C10-D10)*(G10-E10),0)","v":51},{"$f":"RND!G22","v":0},{"$f":"ROUNDDOWN(C10,0)","v":0},{"$f":"IF($J10=0,0,HLOOKUP(D10,$K$9:$AE$10,$A10+1,0))","v":51},{"$f":"ROUNDUP(C10,0)","v":0},{"$f":"IF($J10=0,0,HLOOKUP(F10,$K$9:$AE$10,$A10+1,0))","v":51},{"$f":"RND!G30","v":80},{"$f":"RND!G28","v":29},{"$f":"IF(H10=0,0,I10/H10*100)","v":36.25},{"$f":"ROUND(IF(($J10>=K$6)*($H10>=$I10),K$3*$I10^2/$H10-K$4*$I10+K$5*$H10,IF(($J10>=K$6)*($H10<$I10),K$3*$H10^2/$H10-K$4*$H10+K$5*$H10,$H10-$I10)),2)","v":51},{"$f":"ROUND(IF(($J10>=L$6)*($H10>=$I10),L$3*$I10^2/$H10-L$4*$I10+L$5*$H10,IF(($J10>=L$6)*($H10<$I10),L$3*$H10^2/$H10-L$4*$H10+L$5*$H10,$H10-$I10)),2)","v":51},51,51,51,51.59,52.18,52.77,53.36,54.36,55.36,56.37,57.37,58.38,59.64,60.91,62.17,63.44,64.7,64.7,64.7]
[]
[null,"Mindestrestnunzungsdauer:"]
[null,{"$f":"30%*H10","v":24}]
[null,"maßgeblich:"]
[null,{"$f":"IF(B13>B10,B13,B10)","v":51},"Jahre"]