{"text_format":"1","workbook":"xlsx","n_sheets":11,"sheets":["EingabeMaske","Berechnung und Ergebnis","Vergleichsdaten 2023","Vergleichsfaktoren 2023 (2)","Indizes 2022 Schätzung 2023","Indizes 2023 Schätzung 2024","GebStandard","RND","RND ImmoWertV","Werte","Werte 2"],"not_rendered":{"charts":0,"images":8,"macros":1,"external_links":2,"defined_names":435,"comments":2,"pivot_tables":0},"unopened":[],"bounds":{"document_bytes":16777216,"sheet_cells":100000,"rows_first":2000,"rows_last":500,"rows_between":2000,"halvings":0,"cell_chars":16384,"cell_head_chars":4096},"cells_cut":0,"cells_raw":0,"read":"whole","date_system":"1900"}

{"sheet":"EingabeMaske","index":0,"n_rows":36,"n_cols":13,"rows_kept":36,"cut":false,"hidden":false,"merged":[[25,9,25,11],[27,9,27,11],[30,9,30,12],[31,9,31,11],[35,0,35,4],[35,8,35,12],[26,0,26,2],[25,0,25,2],[26,9,26,10],[3,0,3,4],[12,10,12,12],[11,1,11,3],[4,0,4,4],[5,0,5,4],[8,0,8,3],[12,1,13,3],[12,0,13,0],[14,9,14,11],[20,1,20,2],[23,9,23,11],[24,9,24,11],[15,9,15,11],[16,9,16,11],[18,9,18,11],[20,9,20,11],[21,9,21,11],[19,0,19,2],[19,9,19,11],[22,5,22,7],[17,9,17,10]]}
[null,null,null,"EFH-Rechner, Version 3.1 - 2023",null,null,null,null,null,null,null,null,{"$f":"D1","v":"EFH-Rechner, Version 3.1 - 2023"}]
[]
[]
["Vergleichswertberechnung für Einfamilienwohnhäuser mittels Vergleichswertfaktoren des Landesgrundstücksmarktberichtes 2023"]
["gem. § 182 Abs.2 BewG i. V. m. § 183 BewG. ",null,"Carport"]
[]
["Bitte Hinweise in den Kommentarfeldern in Spalte \"E\" beachten.",null,null,null,null,null,null,null,null,"keine Angabe"]
["Eingabefelder blau","Berechnungsfelder rot"]
[]
["Angaben zum Wertermittlungsobjekt",null,null,null,null,null,null,null,null,"Angaben zum Richtwertobjekt"]
[]
["Adresse und Ort:","Musterstraße 13, 00000 Musterstadt"]
["Gemeinde / Gemarkung / Landkreis bzw. Stadt:"," /  / ",null,null,null,null,null,null,null,"Gemeinde / Gemarkung / Landkreis bzw. Stadt:",{"$f":"B13","v":" /  / "},null,"Bobenheim-Roxheim - Roxheim"]
[null,null,null,null,null,null,null,"1960-01-01",null,"Marktsegment",null,null,{"$f":"ROUND(VLOOKUP(EingabeMaske!B13,'Vergleichsfaktoren 2023 (2)'!A8:I3024,6,FALSE),0)","v":0}]
[null,null,null,null,null,null,null,null,null,"Stichtag:",null,null,"2022-01-01"]
{"$rows_left_out":22}
{"sheet":"Berechnung und Ergebnis","index":1,"n_rows":130,"n_cols":6,"rows_kept":130,"cut":false,"hidden":false,"merged":[[3,0,3,5],[4,0,4,5],[2,0,2,5],[5,1,5,5],[47,0,47,5],[15,1,15,4],[16,1,16,4],[21,1,21,4],[11,0,11,4],[17,1,17,4],[125,3,125,5],[36,0,36,5],[54,0,54,5],[19,1,19,3],[38,0,38,5],[71,0,71,5],[103,0,103,5],[94,0,94,5],[98,1,98,3],[120,0,120,3],[123,0,123,5],[87,0,87,5],[112,0,112,3],[114,0,114,5],[118,0,119,3],[45,0,45,3]]}
[null,null,null,null,null,{"$f":"EingabeMaske!D1","v":"EFH-Rechner, Version 3.1 - 2023"}]
[]
["Vergleichswertberechnung für Ein-/Zweifamilienwohnhäuser mittels Vergleichswertfaktoren des Landesgrundstücksmarktberichtes 2023"]
["gem. § 182 Abs.2 BewG i. V. m. § 183 BewG. "]
[]
["Bezeichnung des Wertermittlungsobjekts\nder Bewertung nach § 183 BewG",{"$f":"EingabeMaske!B12","v":"Musterstraße 13, 00000 Musterstadt"}]
[]
["Angaben zum Wertermittlungsobjekt (WO)"]
[]
["Wertermittlungsstichtag (WST):",null,null,{"$f":"EingabeMaske!H16","v":" "},null,{"$f":"EingabeMaske!D16","v":"2023-01-01"}]
["gesamte Grundstücksgröße (gGG):",null,null,{"$f":"EingabeMaske!H19","v":" "},null,{"$f":"ROUND(EingabeMaske!D19,0)","v":500}]
["bei Aufteilung des Grundstücks in Bewertungsteilflächen: Grundstücksteilfläche (überbaute Fläche zzgl. Umgriffsfläche):",null,null,null,null,{"$f":"LOOKUP(EingabeMaske!A20,Bewertungsgrundstück,'Werte 2'!C2:C4)","v":0}]
["Gebäudestandardstufe (GST): ","(gemäß Erklärung, hilfsweise Schätzung)",null,null,null,{"$f":"ROUND(EingabeMaske!D21,2)","v":3}]
["Wohnfläche (WF):",null,null,null,null,{"$f":"ROUND(EingabeMaske!D22,0)","v":145}]
["Baujahr (BJ):",null,null,null,null,{"$f":"EingabeMaske!D23","v":1995}]
{"$rows_left_out":116}
{"sheet":"Vergleichsdaten 2023","index":2,"n_rows":125,"n_cols":11,"rows_kept":125,"cut":false,"hidden":true,"merged":[]}
[{"$f":"EingabeMaske!A36","v":"     Quelle: Oberer Gutachterausschuss für Grundstückswerte Rheinland-Pfalz gem. Landesgrundstückmarkbericht 2023"}]
[null,null,null,null,null,{"$f":"EingabeMaske!D1","v":"EFH-Rechner, Version 3.1 - 2023"}]
["Wohnfläche",145]
["Gebäudesachwert ohne Außenanlagen und"]
["Nebengebäude zum Stichtag 1.1.2022",{"$f":"B3*EingabeMaske!M17/B12","v":{"$error":"#DIV/0!"}},null,{"$f":"B5*J37","v":{"$error":"#DIV/0!"}}]
["Gebäudestandard",3]
["Gesamtnutzungsdauer (GND)",80]
["Restnutzungsdauer (RND)",65]
["Zeitwert der Außen- und Nebenanlagen",0]
["Zeitwert der Außen- und Nebenanlagen",0]
["Grundstücksgröße",500]
["Sachwertfaktor (freistehend)",{"$f":"ROUND(VLOOKUP(EingabeMaske!B13,'Vergleichsfaktoren 2023 (2)'!A8:I3024,9,FALSE),2)","v":0}]
[]
["1) Die Alterswertminderung des Herstellungswertes des Gebäudes ist bereits im Gebäudesachwert enthalten."]
[]
{"$rows_left_out":111}
{"sheet":"Vergleichsfaktoren 2023 (2)","index":3,"n_rows":3024,"n_cols":9,"rows_kept":3024,"cut":false,"hidden":true,"merged":[]}
[null,"Vergleichsfaktoren (VF) für mit freistehenden Einfamilienwohnhäusern bebaute Grundstücke "]
[null,null,null,"Stichtag ","2020-01-01"]
[null," Modell s. LGMB 2021, Kap. 3.6.1.1 - © Oberer Gutachterausschuss für Grundstückswerte Rheinland-Pfalz"]
[null,"Kurzbeschreibung des Richtwertgrundstücks: Größe 500 m², mittlerer Standard, freistehend KG+EG+ausgeb. DG, Wohnfäche 145 m², Alter 15 Jahre "]
[null,"Hinweis: Sollte eine Gemarkung nicht nachgewiesen sein, kann eine vergleichbare Gemarkung desselben Marktsegments herangezogen werden. "]
["Ergänzung LfSt"]
["Gemeinde / Gemarkung / Landkreis bzw. Stadt","Nr.","Gemarkung","Gemeinde","Landkreis/kreisfreie Stadt","Markt-segment Nr.","BWN €/m² Grdst.fl.","RW €/m² Wohnfl.","SWF"]
[{"$f":"TRIM(D8)&\" / \"&TRIM(C8)&\" / \"&TRIM(E8)","v":"0 / 0 / 0"},0,0,0,0,0,0,null,0]
[{"$f":"TRIM(D9)&\" / \"&TRIM(C9)&\" / \"&TRIM(E9)","v":" /  / "}]
[" /  / "]
[" /  / "]
[" /  / "]
[" /  / "]
[" /  / "]
[" /  / "]
{"$rows_left_out":3010}
{"sheet":"Indizes 2022 Schätzung 2023","index":4,"n_rows":48,"n_cols":24,"rows_kept":48,"cut":false,"hidden":true,"merged":[[14,21,14,22],[15,21,15,22],[16,21,16,22],[17,21,17,22],[7,19,7,20],[8,19,8,20],[10,21,10,22],[11,21,11,22],[12,21,12,22],[13,21,13,22]]}
["Quelle: Oberer Gutachterausschuss für Grundstückswerte Rheinland-Pfalz gem. Landesgrundstückmarkbericht 2023"]
[{"$f":"EingabeMaske!D1","v":"EFH-Rechner, Version 3.1 - 2023"}]
[]
[]
[]
[]
[]
[null,"Indizes jeweils zum 1.1. des Jahres, für Rechner des LfSt inkl. Schätzung 1.1.2023",null,null,null,null,null,null,null,null,null,null,null,null,null,null,null,null,"Marktsegment","Stichtag",null,{"$f":"DATE(T10,1,1)","v":"2023-01-01"},{"$f":"DATE(U10,1,1)","v":"2024-01-01"},"Stichtag Richtwert"]
[null,"Preisindex für bebaute Ein- und Zweifamilienhausgrundstücke",null,null,null,null,null,null,null,null,null,null,null,null,null,"Schätzung","Schätzung",null,{"$f":"EingabeMaske!M14","v":0},{"$f":"EingabeMaske!D16","v":"2023-01-01"},null,"Tage","Tage","2022-01-01"]
[null,"Markt-\nsegment",2010,2011,2012,2013,2014,2015,2016,2017,2018,2019,2020,2021,2022,2023,2024,null,null,{"$f":"YEAR(T9)","v":2023},{"$f":"T10+1","v":2024},{"$f":"_xlfn.DAYS(T9,V8)","v":0},{"$f":"_xlfn.DAYS(W8,V8)","v":365},{"$f":"YEAR(X9)","v":2022}]
[null,1,100,99,100,100,100,101,105,109,116,125,138,156,173,190,{"$f":"P11","v":190},null,1,{"$f":"HLOOKUP(T$10,$C$10:$Q$17,2)","v":190},{"$f":"HLOOKUP(U$10,$C$10:$Q$17,2)","v":190},{"$f":"T11+(U11-T11)*$V$10/$W$10","v":190},null,{"$f":"HLOOKUP($X$10,$E$10:$Q$17,2)","v":173}]
[null,2,100,101,103,104,105,108,112,117,123,132,143,159,175,190,{"$f":"P12","v":190},null,2,{"$f":"HLOOKUP(T$10,$C$10:$Q$17,3)","v":190},{"$f":"HLOOKUP(U$10,$C$10:$Q$17,3)","v":190},{"$f":"T12+(U12-T12)*$V$10/$W$10","v":190},null,{"$f":"HLOOKUP($X$10,$E$10:$Q$17,3)","v":175}]
[null,3,100,102,104,107,108,111,114,121,129,140,155,176,195,212,212,null,3,{"$f":"HLOOKUP(T$10,$C$10:$Q$17,4)","v":212},{"$f":"HLOOKUP(U$10,$C$10:$Q$17,4)","v":212},212,null,{"$f":"HLOOKUP($X$10,$E$10:$Q$17,4)","v":195}]
[null,4,100,102,105,107,111,115,121,130,143,156,171,190,210,226,226,null,4,{"$f":"HLOOKUP(T$10,$C$10:$Q$17,5)","v":226},{"$f":"HLOOKUP(U$10,$C$10:$Q$17,5)","v":226},{"$f":"T14+(U14-T14)*$V$10/$W$10","v":226},null,{"$f":"HLOOKUP($X$10,$E$10:$Q$17,5)","v":210}]
[null,5,100,104,108,114,119,125,133,143,156,170,189,208,225,237,237,null,5,{"$f":"HLOOKUP(T$10,$C$10:$Q$17,6)","v":237},{"$f":"HLOOKUP(U$10,$C$10:$Q$17,6)","v":237},237,null,{"$f":"HLOOKUP($X$10,$E$10:$Q$17,6)","v":225}]
{"$rows_left_out":34}
{"sheet":"Indizes 2023 Schätzung 2024","index":5,"n_rows":20,"n_cols":25,"rows_kept":20,"cut":false,"hidden":true,"merged":[[14,22,14,23],[15,22,15,23],[16,22,16,23],[17,22,17,23],[7,20,7,21],[8,20,8,21],[10,22,10,23],[11,22,11,23],[12,22,12,23],[13,22,13,23]]}
["Quelle: Oberer Gutachterausschuss für Grundstückswerte Rheinland-Pfalz gem. Landesgrundstückmarkbericht 2021"]
[{"$f":"EingabeMaske!D1","v":"EFH-Rechner, Version 3.1 - 2023"}]
[]
[]
[]
[]
[]
[null,"Indizes jeweils zum 1.1. des Jahres, für Rechner des LfSt inkl. Schätzung 1.1.2024",null,null,null,null,null,null,null,null,null,null,null,null,null,null,null,null,null,"Marktsegment","Stichtag",null,{"$f":"DATE(U10,1,1)","v":"2023-01-01"},{"$f":"DATE(V10,1,1)","v":"2024-01-01"},"Stichtag Richtwert"]
[null,"Preisindex für bebaute Ein- und Zweifamilienhausgrundstücke",null,null,null,null,null,null,null,null,null,null,null,null,null,null,"Schätzung","Schätzung",null,{"$f":"EingabeMaske!M14","v":0},{"$f":"EingabeMaske!D16","v":"2023-01-01"},null,"Tage","Tage","2022-01-01"]
[null,"Markt-\nsegment",2010,2011,2012,2013,2014,2015,2016,2017,2018,2019,2020,2021,2022,2023,2024,2025,null,null,{"$f":"YEAR(U9)","v":2023},{"$f":"U10+1","v":2024},{"$f":"_xlfn.DAYS(U9,W8)","v":0},{"$f":"_xlfn.DAYS(X8,W8)","v":365},{"$f":"YEAR(Y9)","v":2022}]
[null,1,100,99,100,100,100,101,105,109,116,125,138,156,184,190,171,171,null,1,{"$f":"HLOOKUP(U$10,$C$10:$R$17,2)","v":190},{"$f":"HLOOKUP(V$10,$C$10:$R$17,2)","v":171},{"$f":"U11+(V11-U11)*$W$10/$X$10","v":190},null,{"$f":"HLOOKUP($Y$10,$E$10:$Q$17,2)","v":184}]
[null,2,100,101,103,104,105,108,112,117,123,132,143,160,183,194,174,174,null,2,{"$f":"HLOOKUP(U$10,$C$10:$R$17,3)","v":194},{"$f":"HLOOKUP(V$10,$C$10:$R$17,3)","v":174},{"$f":"U12+(V12-U12)*$W$10/$X$10","v":194},null,{"$f":"HLOOKUP($Y$10,$E$10:$Q$17,3)","v":183}]
[null,3,100,102,104,107,108,111,114,121,129,140,155,176,200,192,173,173,null,3,{"$f":"HLOOKUP(U$10,$C$10:$R$17,4)","v":192},{"$f":"HLOOKUP(V$10,$C$10:$R$17,4)","v":173},192,null,{"$f":"HLOOKUP($Y$10,$E$10:$Q$17,4)","v":200}]
[null,4,100,102,105,107,111,115,121,130,143,156,171,192,223,212,191,191,null,4,{"$f":"HLOOKUP(U$10,$C$10:$R$17,5)","v":212},{"$f":"HLOOKUP(V$10,$C$10:$R$17,5)","v":191},{"$f":"U14+(V14-U14)*$W$10/$X$10","v":212},null,{"$f":"HLOOKUP($Y$10,$E$10:$Q$17,5)","v":223}]
[null,5,100,104,108,114,119,125,133,143,156,170,189,210,235,222,199,199,null,5,{"$f":"HLOOKUP(U$10,$C$10:$R$17,6)","v":222},{"$f":"HLOOKUP(V$10,$C$10:$R$17,6)","v":199},222,null,{"$f":"HLOOKUP($Y$10,$E$10:$Q$17,6)","v":235}]
{"$rows_left_out":6}
{"sheet":"GebStandard","index":6,"n_rows":25,"n_cols":19,"rows_kept":25,"cut":false,"hidden":false,"merged":[[0,1,0,11],[1,6,1,10],[24,1,24,3]]}
[null,"Gebäudestandards und Wägungsanteile für Ein- und Zweifamilienhäuser, Stufen 1-5 gemäß Anlage 4 der ImmoWertV"]
[]
[]
[null,"Wägungsan- teile (∑100 %)","Stufe 1",null,"Stufe 2",null,"Stufe 3",null,"Stufe 4",null,"Stufe 5"]
[null,"Außenwände","Holzfachwerk, Ziegelmauerwerk; Fugenglattstrich, Putz, Verkleidung mit Faserzementplatten, Bitumenschindeln oder einfachen Kunststoffplatten; kein oder deutlich nicht zeitgemäßer Wärmeschutz (vor ca. 1980)",null,"ein-/zweischaliges Mauerwerk, z. B. Gitterziegel oder Hohlblocksteine; verputzt und gestrichen oder Holzverkleidung; nicht zeitgemäßer Wärmeschutz (vor ca. 1995)",null,"ein-/zweischaliges Mauerwerk, z. B. aus Leichtziegeln, Kalksandsteinen, Gasbetonsteinen; Edelputz; Wärmedämmverbundsystem oder Wärmedämmputz (nach ca. 1995)",null,"Verblendmauerwerk, zweischalig, hinterlüftet, Vorhangfassade (z. B. Naturschiefer); Wärmedämmung (nach ca. 2005)",null,"aufwendig gestaltete Fassaden mit konstruktiver Gliederung (Säulenstell-ungen, Erker etc.), Sichtbeton-Fertig-teile, Natursteinfassade, Elemente aus Kupfer-/Eloxalblech, mehrgeschoss. Glasfassaden; hochwertigste Dämmung",null,null,{"$f":"IF(N6=TRUE,1,0)","v":0},{"$f":"IF(O6=TRUE,1,0)","v":0},1,0,0]
[null,"23%",{"$f":"ROUND($B6/$S6*N5,4)","v":0},null,{"$f":"ROUND($B6/$S6*O5,4)","v":0},null,{"$f":"ROUND($B6/$S6*P5,4)","v":0.23},null,{"$f":"ROUND($B6/$S6*Q5,4)","v":0},null,{"$f":"ROUND($B6/$S6*R5,4)","v":0},null,null,false,false,true,false,false,{"$f":"COUNTIF(N6:R6,TRUE)","v":1}]
[null,"Dach","Dachpappe, Faserzementplatten/ Wellplatten; keine bis geringe Dachdämmung",null,"einfache Betondachsteine oder Tondachziegel,  Bitumenschindeln; nicht zeitgemäße Dachdämmung (vor ca. 1995)",null,"Faserzement-Schindeln, beschichtete Betondachsteine und Tondachziegel, Folienabdichtung; Dachdämmung (nach ca. 1995)",null,"glasierte Tondachziegel, Flachdach- ausbildung tlw. als Dachterrassen; Konstruktion in Brettschichtholz, schweres Massivflachdach; besondere Dachformen, z. B. Mansarden-, Walmdach; Aufsparrendämmung, überdurchschn. Dämmung (nach ca. 2005)",null,"hochwertige Eindeckung z. B. aus Schiefer oder Kupfer, Dachbegrünung, befahrbares Flachdach; stark überdurchschnittliche Dämmung",null,null,{"$f":"IF(N8=TRUE,1,0)","v":0},{"$f":"IF(O8=TRUE,1,0)","v":0},1,0,0]
[null,"15%",{"$f":"ROUND($B8/$S8*N7,4)","v":0},null,{"$f":"ROUND($B8/$S8*O7,4)","v":0},null,{"$f":"ROUND($B8/$S8*P7,4)","v":0.15},null,{"$f":"ROUND($B8/$S8*Q7,4)","v":0},null,{"$f":"ROUND($B8/$S8*R7,4)","v":0},null,null,false,false,true,false,false,{"$f":"COUNTIF(N8:R8,TRUE)","v":1}]
[null,"Fenster und Außentüren","Einfachverglasung; einfache Holztüren",null,"Zweifachverglasung (vor ca. 1995); Haustür mit nicht zeitgemäßem Wärmeschutz (vor ca. 1995)",null,"Zweifachverglasung (nach ca. 1995), Rollläden (manuell); Haustür mit zeitgemäßem Wärmeschutz (nach ca. 1995)",null,"Dreifachverglasung, Sonnenschutz- glas, aufwendigere Rahmen, Rollläden (elektr.); höherwertige Türanlagen z. B. mit Seitenteil, besonderer Einbruchschutz",null,"große feststehende Fensterflächen, Spezialverglasung (Schall- und Sonnenschutz); Außentüren in hochwertigen Materialien",null,null,{"$f":"IF(N10=TRUE,1,0)","v":0},{"$f":"IF(O10=TRUE,1,0)","v":0},1,0,0]
[null,"11%",{"$f":"ROUND($B10/$S10*N9,4)","v":0},null,{"$f":"ROUND($B10/$S10*O9,4)","v":0},null,{"$f":"ROUND($B10/$S10*P9,4)","v":0.11},null,{"$f":"ROUND($B10/$S10*Q9,4)","v":0},null,{"$f":"ROUND($B10/$S10*R9,4)","v":0},null,null,false,false,true,false,false,{"$f":"COUNTIF(N10:R10,TRUE)","v":1}]
[null,"Innenwände und -türen","Fachwerkwände, einfache Putze/Lehmputze, einfache Kalkanstriche; Füllungstüren, gestrichen, mit einfachen Beschlägen ohne Dichtungen",null,"massive tragende Innenwände, nicht tragende Wände in Leichtbauweise   (z. B. Holzständerwände mit Gipskarton), Gipsdielen; leichte Türen, Stahlzargen",null,"nicht tragende Innenwände in massiver Ausführung bzw. mit Dämmmaterial gefüllte Ständerkonstruktionen; schwere Türen",null,"Sichtmauerwerk; Massivholztüren, Schiebetürelemente, Glastüren, strukturierte Türblätter",null,"gestaltete Wandabläufe (z. B. Pfeilervorlagen, abgesetzte oder geschwungene Wandpartien);  Brandschutzverkleidung; raumhohe aufwendige Türelemente",null,null,{"$f":"IF(N12=TRUE,1,0)","v":0},{"$f":"IF(O12=TRUE,1,0)","v":0},1,0,0]
[null,"11%",{"$f":"ROUND($B12/$S12*N11,4)","v":0},null,{"$f":"ROUND($B12/$S12*O11,4)","v":0},null,{"$f":"ROUND($B12/$S12*P11,4)","v":0.11},null,{"$f":"ROUND($B12/$S12*Q11,4)","v":0},null,{"$f":"ROUND($B12/$S12*R11,4)","v":0},null,null,false,false,true,false,false,{"$f":"COUNTIF(N12:R12,TRUE)","v":1}]
[null,"Deckenkon- struktion","Holzbalkendecken ohne Füllung, Spalierputz; Weichholztreppen in einfacher Art und Ausführung; kein Trittschallschutz",null,"Holzbalkendecken mit Füllung, Kappendecken; Stahl- oder Hartholztreppen in einfacher Art und Ausführung",null,"Beton- und Holzbalkendecken mit Tritt- und Luftschallschutz (z. B. schwimmender Estrich); geradläufige Treppen aus Stahlbeton oder Stahl, Harfentreppe, Trittschallschutz",null,"Decken mit größerer Spannweite, Deckenverkleidung (Holzpaneele/Kasseten); gewendelte Treppen aus Stahlbeton oder Stahl, Hartholztreppenanlage in besserer Art und Ausführung",null,"Decken mit großen Spannweiten, Deckenvertäfelungen (Edelholz, Metall); breite Stahlbeton-, Metall- oder Holztreppenanlage mit hochwertigem Geländer",null,null,{"$f":"IF(N14=TRUE,1,0)","v":0},{"$f":"IF(O14=TRUE,1,0)","v":0},1,0,0]
[null,"11%",{"$f":"ROUND($B14/$S14*N13,4)","v":0},null,{"$f":"ROUND($B14/$S14*O13,4)","v":0},null,{"$f":"ROUND($B14/$S14*P13,4)","v":0.11},null,{"$f":"ROUND($B14/$S14*Q13,4)","v":0},null,{"$f":"ROUND($B14/$S14*R13,4)","v":0},null,null,false,false,true,false,false,{"$f":"COUNTIF(N14:R14,TRUE)","v":1}]
[null,"Fußböden ","ohne Belag",null,"Linoleum-, Teppich-, Laminat- und PVC-Böden einfacher Art und Ausführung",null,"Linoleum-, Teppich-, Laminat- und PVC-Böden besserer Art und Ausführung, Fliesen, Kunststeinplatten",null,"Natursteinplatten, Fertigparkett, hochwertige Fliesen, Terrazzobelag, hochwertige Massivholzböden auf aufgedämmter Unterkonstruktion",null,"hochwertiges Parkett, hochwertige Natursteinplatten, hochwertige Edelholzböden auf gedämmter Unterkonstruktion",null,null,{"$f":"IF(N16=TRUE,1,0)","v":0},{"$f":"IF(O16=TRUE,1,0)","v":0},1,0,0]
{"$rows_left_out":11}
{"sheet":"RND","index":7,"n_rows":34,"n_cols":18,"rows_kept":34,"cut":false,"hidden":false,"merged":[[33,1,33,3],[32,1,32,4],[32,5,32,8],[33,5,33,8],[0,0,0,9],[1,0,1,9],[2,5,2,7],[2,0,2,4],[3,0,3,4],[3,5,3,7],[4,0,4,4],[4,5,4,7],[5,0,5,4],[5,5,5,7],[6,0,6,4],[6,5,6,7],[7,0,7,4],[7,5,7,7],[8,0,8,4],[8,5,8,7],[9,0,9,4],[9,5,9,7],[10,0,10,4],[10,5,10,7],[11,0,11,4],[11,5,11,7],[24,11,24,15],[13,0,15,9],[16,0,16,9],[17,0,17,4],[17,5,17,7],[18,0,18,4],[19,0,19,4],[20,0,20,4],[21,0,21,4],[22,0,22,4],[23,0,23,8],[24,0,24,8],[31,1,31,3],[31,5,31,7],[25,0,30,0],[25,5,25,8],[26,1,26,4],[26,5,26,8],[27,1,27,4],[27,5,27,7],[28,1,28,8],[29,1,29,4],[29,5,29,7],[30,5,30,7]]}
["Modell zur Ermittlung der Restnutzungsdauer für Wohngebäude bei Modernisierungen (Anlage 2 ImmoWertV) "]
[]
["Modernisierungselemente",null,null,null,null,"max. Punkte",null,null,"tats. Punkte"," Kommentar"]
["Dacherneuerung inklusive Verbesserung der Wärmedämmung",null,null,null,null,4,null,null,null,null,60,1]
["Modernisierung der Fenster und Außentüren",null,null,null,null,{"$f":"IF(I5>3,\"TILT max. 2 \",2)","v":2},null,null,null,null,65,2]
["Modernisierung der Leitungssysteme (Strom, Gas, Wasser, Abwasser)",null,null,null,null,{"$f":"IF(I6>3,\"TILT max. 2 \",2)","v":2},null,null,null,null,70,3]
["Modernisierung der Heizungsanlage",null,null,null,null,{"$f":"IF(I7>3,\"TILT max. 2 \",2)","v":2},null,null,null,null,75,4]
["Wärmedämmung der Außenwände",null,null,null,null,4,null,null,null,null,80]
["Modernisierung von Bädern ",null,null,null,null,{"$f":"IF(I9>3,\"TILT max. 2 \",2)","v":2},null,null,null,null,90]
["Modernisierung des Innenausbaus, z.B. Decken, Fußböden, Treppen",null,null,null,null,2,null,null,null,null,null,{"$f":"IF(AND(#REF!<>\"\",I12=0),\"Einblenden\",\"Ausblenden\")","v":{"$error":"#REF!"}}]
["Wesentliche Verbesserung der Grundrissgestaltung",null,null,null,null,2]
["Summe",null,null,null,null,{"$f":"SUM(F4:F11)","v":20},null,null,{"$f":"SUM(I4:I11)","v":0},null,null,{"$f":"IF(I12>0,#REF!=0)","v":false}]
[]
["Liegen die Maßnahmen weiter zurück, ist zu prüfen, ob nicht ein geringerer als der maximale Tabellenwert anzusetzen ist.\nSofern nicht modernisierte Bauelemente noch zeitgemäßen Ansprüchen genügen, sind entsprechende Punkte zu vergeben."]
[]
{"$rows_left_out":20}
{"sheet":"RND ImmoWertV","index":8,"n_rows":15,"n_cols":31,"rows_kept":15,"cut":false,"hidden":true,"merged":[]}
[]
["Restnutzungsdauer bei Modernisierung nach ImmoWertV"]
[null,null,null,null,null,null,null,null,null,"a",1.25,1.25,1.0767,0.90329999999999999,0.73,0.67249999999999999,0.61499999999999999,0.5575,0.5,0.46600000000000003,0.432,0.39800000000000002,0.36399999999999999,0.33,0.30399999999999999,0.27800000000000002,0.252,0.22600000000000001,0.2,0.2,0.2]
[null,null,null,null,null,null,null,null,null,"b",2.625,2.625,2.2757000000000001,1.9262999999999999,1.577,1.4578,1.3385,1.2193000000000001,1.1000000000000001,1.0269999999999999,0.95399999999999996,0.88100000000000001,0.80800000000000005,0.73499999999999999,0.67600000000000005,0.61699999999999999,0.55800000000000005,0.499,0.44,0.44,0.44]
[null,null,null,null,null,null,null,null,null,"c",1.5249999999999999,1.5249999999999999,1.3877999999999999,1.2504999999999999,1.1133,1.085,1.0567,1.0283,1,0.99060000000000004,0.98109999999999997,0.97170000000000001,0.96220000000000006,0.95279999999999998,0.9506,0.94850000000000001,0.94630000000000003,0.94420000000000004,0.94199999999999995,0.94199999999999995,0.94199999999999995]
[null,null,null,null,null,null,null,null,null,"ab rel. Alter",60,60,55,55,40,35,30,25,20,19,18,17,16,15,14,13,12,11,10,10,10]
[]
[null,"Ergebnis",null,null,null,null,null,"Vorgaben"]
[null,"RND","Pkte","abger. Pkte","RND","aufger. Pkte","RND","GND","Alter","rel. Alter [%]",0,{"$f":"K9+1","v":1},{"$f":"L9+1","v":2},3,4,5,6,7,8,9,10,11,12,13,14,15,16,17,18,19,20]
[1,{"$f":"ROUND(E10+(C10-D10)*(G10-E10),0)","v":52},{"$f":"RND!I12","v":0},{"$f":"ROUNDDOWN(C10,0)","v":0},{"$f":"IF($J10=0,0,HLOOKUP(D10,$K$9:$AE$10,$A10+1,0))","v":52},{"$f":"ROUNDUP(C10,0)","v":0},{"$f":"IF($J10=0,0,HLOOKUP(F10,$K$9:$AE$10,$A10+1,0))","v":52},{"$f":"RND!F30","v":80},{"$f":"RND!F28","v":28},{"$f":"IF(H10=0,0,I10/H10*100)","v":35},{"$f":"ROUND(IF(($J10>=K$6)*($H10>=$I10),K$3*$I10^2/$H10-K$4*$I10+K$5*$H10,IF(($J10>=K$6)*($H10<$I10),K$3*$H10^2/$H10-K$4*$H10+K$5*$H10,$H10-$I10)),2)","v":52},{"$f":"ROUND(IF(($J10>=L$6)*($H10>=$I10),L$3*$I10^2/$H10-L$4*$I10+L$5*$H10,IF(($J10>=L$6)*($H10<$I10),L$3*$H10^2/$H10-L$4*$H10+L$5*$H10,$H10-$I10)),2)","v":52},52,52,52,52.57,53.09,53.59,54.1,55.06,56.01,56.97,57.92,58.88,60.1,61.33,62.55,63.78,65,65,65]
[]
[null,"Mindestrestnutzungsdauer:"]
[null,{"$f":"30%*H10","v":24}]
[null,"maßgeblich:"]
[null,{"$f":"IF(B13>B10,B13,B10)","v":52},"Jahre"]
{"$rows_left_out":1}
{"sheet":"Werte","index":9,"n_rows":9,"n_cols":1,"rows_kept":9,"cut":false,"hidden":true,"merged":[]}
["Garage"]
["Doppelgarage"]
["Carport"]
["Carport und Garage"]
["Sonstiges (freie Eingabe)"]
[]
[]
["freistehend / DHH / REH"]
["Reihenmittelhaus"]

{"sheet":"Werte 2","index":10,"n_rows":4,"n_cols":14,"rows_kept":4,"cut":false,"hidden":true,"merged":[]}
["Bewertungsgrundstück","WO gesamt","WO","BRW","UK WO","UK RW",null,null,null,null,"Restfläche"]
["Fall 1: Eine Aufteilung in selbstständig verwertbare und baulich nutzbare Teilflächen ist möglich. Die Teilfläche des bebauten Grundstücksteils (überbaute Fläche zzgl. Umgriffsfläche) beträgt:",{"$f":"EingabeMaske!D19","v":500},{"$f":"EingabeMaske!D20","v":0},{"$f":"EingabeMaske!D27","v":500},{"$f":"IF(C2*D2>0,1.7*C2^(-0.0855),\"\")","v":""},{"$f":"IF(C2*D2>0,1.7*D2^(-0.0855),\"\")","v":""},{"$f":"IF(C2*D2>0,E2/F2,1)","v":1},{"$f":"B2-C2","v":500},"selbstständig verwertbare Teilfläche","Anpassung an die Grundstücksgröße",{"$f":"IF(C2=0,0,B2-C2)","v":0},{"$f":"IF(C2*D2>0,1.7*K2^(-0.0855),\"\")","v":""},{"$f":"IF(C2*D2>0,L2/F2,1)","v":1},{"$f":"IF(EingabeMaske!D20=0,\"Angabe der Fläche erforderlich\",\"\")","v":"Angabe der Fläche erforderlich"}]
["Fall 2: Die mittlere Grundstückstiefe liegt über 40 m. Eine Aufteilung in selbstständig verwertbare und baulich nutzbare Teilflächen ist nicht möglich. Die Fläche bis zu 40 m Tiefe (Vorderland) beträgt:",{"$f":"EingabeMaske!D19","v":500},{"$f":"EingabeMaske!D20","v":0},{"$f":"EingabeMaske!D27","v":500},{"$f":"IF(C3*D3>0,1.7*C3^(-0.0855),\"\")","v":""},{"$f":"IF(C3*D3>0,1.7*D3^(-0.0855),\"\")","v":""},{"$f":"IF(C3*D3>0,E3/F3,1)","v":1},{"$f":"B3-C3","v":500},"Hinterlandfläche","Wertfaktor für Hinterland",{"$f":"IF(C3=0,0,B3-C3)","v":0},{"$f":"IF(C3*D3>0,1.7*K3^(-0.0855),\"\")","v":""},0.25,{"$f":"IF(EingabeMaske!D20=0,\"Angabe der Fläche erforderlich\",\"\")","v":"Angabe der Fläche erforderlich"}]
["Fall 3: Eine Aufteilung in selbstständig verwertbare und baulich nutzbare Teilflächen ist nicht möglich. Die mittlere Tiefe des Grundstücks liegt unter 40 m. Eintrag auf 0 setzen.",{"$f":"EingabeMaske!D19","v":500},0,{"$f":"EingabeMaske!D27","v":500},{"$f":"IF(D4>0,1.7*B4^(-0.0855),\"\")","v":0.99927951831873274},{"$f":"IF(D4>0,1.7*D4^(-0.0855),\"\")","v":0.99927951831873274},{"$f":"IF(D4>0,E4/F4,1)","v":1},{"$f":"0","v":0},null,null,0,null,null,{"$f":"IF(EingabeMaske!D20>0,\"Eintag auf 0 m² setzen\",\"\")","v":""}]